BDBM74466 2-[[4-(4-fluorophenyl)-5-[(1-methylpyrrol-2-yl)methyl]-1,2,4-triazol-3-yl]thio]-N-o-phenetyl-acetamide::MLS000118736::N-(2-ethoxyphenyl)-2-[[4-(4-fluorophenyl)-5-[(1-methyl-2-pyrrolyl)methyl]-1,2,4-triazol-3-yl]thio]acetamide::N-(2-ethoxyphenyl)-2-[[4-(4-fluorophenyl)-5-[(1-methylpyrrol-2-yl)methyl]-1,2,4-triazol-3-yl]sulfanyl]acetamide::N-(2-ethoxyphenyl)-2-[[4-(4-fluorophenyl)-5-[(1-methylpyrrol-2-yl)methyl]-1,2,4-triazol-3-yl]sulfanyl]ethanamide::SMR000095676::cid_5308008
SMILES CCOc1ccccc1NC(=O)CSc1nnc(Cc2cccn2C)n1-c1ccc(F)cc1
InChI Key InChIKey=YPHMJHIBPYBVFG-UHFFFAOYSA-N
Data  3 IC50
  Tab Delimited (TSV)   2D SDfile   Computed 3D by Vconf -m prep SDfile
Find this compound or compounds like it in BindingDB:
Activity Spreadsheet -- Enzyme Inhibition Constant Data from BindingDB
Found 3 hits for monomerid = 74466
TargetTyrosine-protein phosphatase non-receptor type 22(Homo sapiens (Human))
Burnham Center For Chemical Genomics
Curated by PubChem BioAssay
LigandPNGBDBM74466(2-[[4-(4-fluorophenyl)-5-[(1-methylpyrrol-2-yl)met...)
Affinity DataIC50: >7.94E+4nM. Assay description: Data Source: Sanford-Burnham Center for Chemical Genomics (SBCCG) Source Affiliation: Sanford-Burnham Medical Research Institute (SBMRI, San Diego, ...
In DepthDetails PCBioAssay
TargetTyrosine-protein phosphatase non-receptor type 22(Homo sapiens (Human))
Burnham Center For Chemical Genomics
Curated by PubChem BioAssay
LigandPNGBDBM74466(2-[[4-(4-fluorophenyl)-5-[(1-methylpyrrol-2-yl)met...)
Affinity DataIC50: >7.94E+4nM. Assay description: Data Source: Sanford-Burnham Center for Chemical Genomics (SBCCG) Source Affiliation: Sanford-Burnham Medical Research Institute (SBMRI, San Diego, ...
In DepthDetails PCBioAssay
TargetTyrosine-protein phosphatase non-receptor type 7(Homo sapiens (Human))
Burnham Center For Chemical Genomics
Curated by PubChem BioAssay
LigandPNGBDBM74466(2-[[4-(4-fluorophenyl)-5-[(1-methylpyrrol-2-yl)met...)
Affinity DataIC50: >7.94E+4nM. Assay description: Data Source: Sanford-Burnham Center for Chemical Genomics (SBCCG) Source Affiliation: Sanford-Burnham Medical Research Institute (SBMRI, San Diego, C...
In DepthDetails PCBioAssay