BDBM74497 5-tert-butyl-1-(3-chlorobenzoyl)-5-hydroxy-2-pyrazoline-3-carboxylic acid methyl ester::5-tert-butyl-1-[(3-chlorophenyl)-oxomethyl]-5-hydroxy-4H-pyrazole-3-carboxylic acid methyl ester::MLS000702288::SMR000225979::cid_11836274::methyl 5-tert-butyl-1-(3-chlorobenzoyl)-5-hydroxy-4,5-dihydro-1H-pyrazole-3-carboxylate::methyl 5-tert-butyl-1-(3-chlorobenzoyl)-5-hydroxy-4H-pyrazole-3-carboxylate::methyl 5-tert-butyl-1-(3-chlorophenyl)carbonyl-5-oxidanyl-4H-pyrazole-3-carboxylate
SMILES COC(=O)C1=NN(C(=O)c2cccc(Cl)c2)C(O)(C1)C(C)(C)C
InChI Key InChIKey=ZYMNBLQXUDVHOB-UHFFFAOYSA-N
Data  3 IC50
  Tab Delimited (TSV)   2D SDfile   Computed 3D by Vconf -m prep SDfile
Find this compound or compounds like it in BindingDB:
Activity Spreadsheet -- Enzyme Inhibition Constant Data from BindingDB
Found 3 hits for monomerid = 74497
TargetTyrosine-protein phosphatase non-receptor type 22(Homo sapiens (Human))
Burnham Center For Chemical Genomics
Curated by PubChem BioAssay
LigandPNGBDBM74497(5-tert-butyl-1-(3-chlorobenzoyl)-5-hydroxy-2-pyraz...)
Affinity DataIC50: >7.94E+4nM. Assay description: Data Source: Sanford-Burnham Center for Chemical Genomics (SBCCG) Source Affiliation: Sanford-Burnham Medical Research Institute (SBMRI, San Diego, ...
In DepthDetails PCBioAssay
TargetTyrosine-protein phosphatase non-receptor type 22(Homo sapiens (Human))
Burnham Center For Chemical Genomics
Curated by PubChem BioAssay
LigandPNGBDBM74497(5-tert-butyl-1-(3-chlorobenzoyl)-5-hydroxy-2-pyraz...)
Affinity DataIC50: >7.94E+4nM. Assay description: Data Source: Sanford-Burnham Center for Chemical Genomics (SBCCG) Source Affiliation: Sanford-Burnham Medical Research Institute (SBMRI, San Diego, ...
In DepthDetails PCBioAssay
TargetTyrosine-protein phosphatase non-receptor type 7(Homo sapiens (Human))
Burnham Center For Chemical Genomics
Curated by PubChem BioAssay
LigandPNGBDBM74497(5-tert-butyl-1-(3-chlorobenzoyl)-5-hydroxy-2-pyraz...)
Affinity DataIC50: >7.94E+4nM. Assay description: Data Source: Sanford-Burnham Center for Chemical Genomics (SBCCG) Source Affiliation: Sanford-Burnham Medical Research Institute (SBMRI, San Diego, C...
In DepthDetails PCBioAssay