BDBM74534 7,8-dichloro-4-(2-morpholinoethylamino)quinoline-3-carboxylic acid ethyl ester;hydrochloride::7,8-dichloro-4-[2-(4-morpholinyl)ethylamino]-3-quinolinecarboxylic acid ethyl ester;hydrochloride::MLS001196755::SMR000555959::cid_2790719::ethyl 7,8-bis(chloranyl)-4-(2-morpholin-4-ylethylamino)quinoline-3-carboxylate;hydrochloride::ethyl 7,8-dichloro-4-(2-morpholin-4-ylethylamino)quinoline-3-carboxylate;hydrochloride::ethyl 7,8-dichloro-4-[(2-morpholin-4-ylethyl)amino]quinoline-3-carboxylate
SMILES CCOC(=O)c1cnc2c(Cl)c(Cl)ccc2c1NCCN1CCOCC1
InChI Key InChIKey=STNYKOYIGYMNAT-UHFFFAOYSA-N
Data  3 IC50
  Tab Delimited (TSV)   2D SDfile   Computed 3D by Vconf -m prep SDfile
Find this compound or compounds like it in BindingDB:
Activity Spreadsheet -- Enzyme Inhibition Constant Data from BindingDB
Found 3 hits for monomerid = 74534
TargetTyrosine-protein phosphatase non-receptor type 22(Homo sapiens (Human))
Burnham Center For Chemical Genomics
Curated by PubChem BioAssay
LigandPNGBDBM74534(7,8-dichloro-4-(2-morpholinoethylamino)quinoline-3...)
Affinity DataIC50: >7.94E+4nM. Assay description: Data Source: Sanford-Burnham Center for Chemical Genomics (SBCCG) Source Affiliation: Sanford-Burnham Medical Research Institute (SBMRI, San Diego, ...
In DepthDetails PCBioAssay
TargetTyrosine-protein phosphatase non-receptor type 22(Homo sapiens (Human))
Burnham Center For Chemical Genomics
Curated by PubChem BioAssay
LigandPNGBDBM74534(7,8-dichloro-4-(2-morpholinoethylamino)quinoline-3...)
Affinity DataIC50: >7.94E+4nM. Assay description: Data Source: Sanford-Burnham Center for Chemical Genomics (SBCCG) Source Affiliation: Sanford-Burnham Medical Research Institute (SBMRI, San Diego, ...
In DepthDetails PCBioAssay
TargetTyrosine-protein phosphatase non-receptor type 7(Homo sapiens (Human))
Burnham Center For Chemical Genomics
Curated by PubChem BioAssay
LigandPNGBDBM74534(7,8-dichloro-4-(2-morpholinoethylamino)quinoline-3...)
Affinity DataIC50: >7.94E+4nM. Assay description: Data Source: Sanford-Burnham Center for Chemical Genomics (SBCCG) Source Affiliation: Sanford-Burnham Medical Research Institute (SBMRI, San Diego, C...
In DepthDetails PCBioAssay