BDBM74569 3-(benzylthio)-6,6,7-trimethyl-1-morpholino-5,8-dihydro-2,7-naphthyridine-4-carbonitrile::3-benzylsulfanyl-6,6,7-trimethyl-1-morpholin-4-yl-5,8-dihydro-2,7-naphthyridine-4-carbonitrile::6,6,7-trimethyl-1-(4-morpholinyl)-3-(phenylmethylthio)-5,8-dihydro-2,7-naphthyridine-4-carbonitrile::6,6,7-trimethyl-1-morpholin-4-yl-3-(phenylmethylsulfanyl)-5,8-dihydro-2,7-naphthyridine-4-carbonitrile::MLS000071219::SMR000036065::cid_658010
SMILES CN1Cc2c(CC1(C)C)c(C#N)c(SCc1ccccc1)nc2N1CCOCC1
InChI Key InChIKey=ZKZWUEUAOWRWKC-UHFFFAOYSA-N
Data  2 IC50  2 EC50
  Tab Delimited (TSV)   2D SDfile   Computed 3D by Vconf -m prep SDfile
Find this compound or compounds like it in BindingDB:
Activity Spreadsheet -- Enzyme Inhibition Constant Data from BindingDB
Found 4 hits for monomerid = 74569
TargetImportin subunit alpha-1(Homo sapiens (Human))
Broad Institute
Curated by PubChem BioAssay
LigandPNGBDBM74569(3-(benzylthio)-6,6,7-trimethyl-1-morpholino-5,8-di...)
Affinity DataEC50:  1.22E+5nM. Assay description: Keywords: Counterscreen, FRET assay, HTS, YIC probe, Dose response, Assay Overview: This is a fluorescence resonance energy transfer (FRET)-based b...
In DepthDetails PCBioAssay
TargetCorticotropin-releasing factor-binding protein(Homo sapiens (Human))
Burnham Center For Chemical Genomics
Curated by PubChem BioAssay
LigandPNGBDBM74569(3-(benzylthio)-6,6,7-trimethyl-1-morpholino-5,8-di...)
Affinity DataEC50: >5.30E+4nM. Assay description: Data Source: Sanford-Burnham Center for Chemical Genomics (SBCCG) Source Affiliation: Sanford-Burnham Medical Research Institute (SBMRI, San Diego, C...
In DepthDetails PCBioAssay
TargetPolyadenylate-binding protein 1(Homo sapiens (Human))
Burnham Center For Chemical Genomics
Curated by PubChem BioAssay
LigandPNGBDBM74569(3-(benzylthio)-6,6,7-trimethyl-1-morpholino-5,8-di...)
Affinity DataIC50: >6.60E+4nM. Assay description: Data Source: Sanford-Burnham Center for Chemical Genomics (SBCCG) Source Affiliation: Sanford-Burnham Medical Research Institute (SBMRI, San Diego, C...
In DepthDetails PCBioAssay
TargetPolyadenylate-binding protein 1(Homo sapiens (Human))
Burnham Center For Chemical Genomics
Curated by PubChem BioAssay
LigandPNGBDBM74569(3-(benzylthio)-6,6,7-trimethyl-1-morpholino-5,8-di...)
Affinity DataIC50: >6.60E+4nM. Assay description: Data Source: Sanford-Burnham Center for Chemical Genomics (SBCCG) Source Affiliation: Sanford-Burnham Medical Research Institute (SBMRI, San Diego, C...
In DepthDetails PCBioAssay