BDBM74615 (E)-3-amino-2-(2-quinazolin-4-yloxyacetyl)but-2-enenitrile::(E)-3-amino-2-[1-oxo-2-(4-quinazolinyloxy)ethyl]-2-butenenitrile::(E)-3-azanyl-2-(2-quinazolin-4-yloxyethanoyl)but-2-enenitrile::MLS000058214::SMR000063319::cid_5742536
SMILES CC(=N)C(C#N)C(=O)COc1ncnc2ccccc12
InChI Key InChIKey=ZOCFMYQTEWRJJZ-UHFFFAOYSA-N
Data  1 EC50
  Tab Delimited (TSV)   2D SDfile   Computed 3D by Vconf -m prep SDfile
Find this compound or compounds like it in BindingDB:
Activity Spreadsheet -- Enzyme Inhibition Constant Data from BindingDB
Found 1 hit for monomerid = 74615
TargetImportin subunit alpha-1(Homo sapiens (Human))
Broad Institute
Curated by PubChem BioAssay
LigandPNGBDBM74615((E)-3-amino-2-(2-quinazolin-4-yloxyacetyl)but-2-en...)
Affinity DataEC50: >5.00E+5nM. Assay description: Keywords: Counterscreen, FRET assay, HTS, YIC probe, Dose response, Assay Overview: This is a fluorescence resonance energy transfer (FRET)-based b...
In DepthDetails PCBioAssay