BDBM74677 3-methyl-6-(1-piperidinyl)-1H-pyrimidine-2,4-dione::3-methyl-6-piperidin-1-yl-1H-pyrimidine-2,4-dione::3-methyl-6-piperidino-uracil::MLS000102781::SMR000018179::cid_5310262
SMILES Cn1c(=O)cc([nH]c1=O)N1CCCCC1
InChI Key InChIKey=FPQAECSZKHNHNQ-UHFFFAOYSA-N
Data  1 EC50
  Tab Delimited (TSV)   2D SDfile   Computed 3D by Vconf -m prep SDfile
Find this compound or compounds like it in BindingDB:
Activity Spreadsheet -- Enzyme Inhibition Constant Data from BindingDB
Found 1 hit for monomerid = 74677
TargetImportin subunit alpha-1(Homo sapiens (Human))
Broad Institute
Curated by PubChem BioAssay
LigandPNGBDBM74677(3-methyl-6-(1-piperidinyl)-1H-pyrimidine-2,4-dione...)
Affinity DataEC50: >5.00E+5nM. Assay description: Keywords: Counterscreen, FRET assay, HTS, YIC probe, Dose response, Assay Overview: This is a fluorescence resonance energy transfer (FRET)-based b...
In DepthDetails PCBioAssay