BDBM75330 2-methoxy-3-(2-phenyl-1,2,3,4-tetrazol-5-yl)pyridine::2-methoxy-3-(2-phenyl-5-tetrazolyl)pyridine::2-methoxy-3-(2-phenyltetrazol-5-yl)pyridine::MLS-0067094.0001::cid_16066543
SMILES COc1ncccc1-c1nnn(n1)-c1ccccc1
InChI Key InChIKey=SGXXNVKAZRUNAW-UHFFFAOYSA-N
Data  1 IC50
  Tab Delimited (TSV)   2D SDfile   Computed 3D by Vconf -m prep SDfile
Find this compound or compounds like it in BindingDB:
Activity Spreadsheet -- Enzyme Inhibition Constant Data from BindingDB
Found 1 hit for monomerid = 75330
TargetDual specificity protein phosphatase 3(Homo sapiens (Human))
Burnham Center For Chemical Genomics
Curated by PubChem BioAssay
LigandPNGBDBM75330(2-methoxy-3-(2-phenyl-1,2,3,4-tetrazol-5-yl)pyridi...)
Affinity DataIC50: >1.00E+5nM. Assay description: Data Source: Burnham Center for Chemical Genomics (BCCG) Source Affiliation: Sanford-Burnham Medical Research Institute (SBMRI, San Diego, CA) Networ...
In DepthDetails PCBioAssay