BDBM75341 3-[2-(4-fluorophenyl)-1,2,3,4-tetrazol-5-yl]pyridine::3-[2-(4-fluorophenyl)-5-tetrazolyl]pyridine::3-[2-(4-fluorophenyl)tetrazol-5-yl]pyridine::MLS-0067108.0001::cid_16066652
SMILES Fc1ccc(cc1)-n1nnc(n1)-c1cccnc1
InChI Key InChIKey=ZKSRLWDIPGOPBD-UHFFFAOYSA-N
Data  3 IC50
  Tab Delimited (TSV)   2D SDfile   Computed 3D by Vconf -m prep SDfile
Find this compound or compounds like it in BindingDB:
Activity Spreadsheet -- Enzyme Inhibition Constant Data from BindingDB
Found 3 hits for monomerid = 75341
TargetDual specificity protein phosphatase 3(Homo sapiens (Human))
Burnham Center For Chemical Genomics
Curated by PubChem BioAssay
LigandPNGBDBM75341(3-[2-(4-fluorophenyl)-1,2,3,4-tetrazol-5-yl]pyridi...)
Affinity DataIC50: >1.00E+5nM. Assay description: Data Source: Burnham Center for Chemical Genomics (BCCG) Source Affiliation: Sanford-Burnham Medical Research Institute (SBMRI, San Diego, CA) Networ...
In DepthDetails PCBioAssay
TargetHeat shock protein hsp-16.2(Caenorhabditis elegans)
Burnham Center For Chemical Genomics
Curated by PubChem BioAssay
LigandPNGBDBM75341(3-[2-(4-fluorophenyl)-1,2,3,4-tetrazol-5-yl]pyridi...)
Affinity DataIC50:  4.51E+4nM
In DepthDetails PCBioAssay
TargetProtein skinhead-1(Caenorhabditis elegans)
Burnham Center For Chemical Genomics
Curated by PubChem BioAssay
LigandPNGBDBM75341(3-[2-(4-fluorophenyl)-1,2,3,4-tetrazol-5-yl]pyridi...)
Affinity DataIC50:  2.48E+4nM
In DepthDetails PCBioAssay