BDBM75368 1-(2,3-dihydro-1H-inden-5-yl)-3-(4-sulfamoylphenyl)thiourea::1-indan-5-yl-3-(4-sulfamoylphenyl)thiourea::MLS-0435634.0001::cid_970693
SMILES NS(=O)(=O)c1ccc(NC(=S)Nc2ccc3CCCc3c2)cc1
InChI Key InChIKey=YFYGTMSBDSPQIR-UHFFFAOYSA-N
Data  2 IC50
  Tab Delimited (TSV)   2D SDfile   Computed 3D by Vconf -m prep SDfile
Find this compound or compounds like it in BindingDB:
Activity Spreadsheet -- Enzyme Inhibition Constant Data from BindingDB
Found 2 hits for monomerid = 75368
TargetTyrosine-protein phosphatase non-receptor type 7(Homo sapiens (Human))
Burnham Center For Chemical Genomics
Curated by PubChem BioAssay
LigandPNGBDBM75368(1-(2,3-dihydro-1H-inden-5-yl)-3-(4-sulfamoylphenyl...)
Affinity DataIC50:  7.93E+3nM. Assay description: Data Source: Sanford-Burnham Center for Chemical Genomics (SBCCG) Source Affiliation: Sanford-Burnham Medical Research Institute (SBMRI, San Diego, C...
In DepthDetails PCBioAssay
TargetDual specificity protein phosphatase 3(Homo sapiens (Human))
Burnham Center For Chemical Genomics
Curated by PubChem BioAssay
LigandPNGBDBM75368(1-(2,3-dihydro-1H-inden-5-yl)-3-(4-sulfamoylphenyl...)
Affinity DataIC50:  1.21E+4nM. Assay description: Data Source: Burnham Center for Chemical Genomics (BCCG) Source Affiliation: Sanford-Burnham Medical Research Institute (SBMRI, San Diego, CA) Networ...
In DepthDetails PCBioAssay