BDBM75415 4-[4-(2-furanylmethyl)-5-(phenylmethylthio)-1,2,4-triazol-3-yl]pyridine::4-[4-(furan-2-ylmethyl)-5-(phenylmethylsulfanyl)-1,2,4-triazol-3-yl]pyridine::4-[5-(benzylthio)-4-(2-furfuryl)-1,2,4-triazol-3-yl]pyridine::4-[5-benzylsulfanyl-4-(furan-2-ylmethyl)-1,2,4-triazol-3-yl]pyridine::KSC-12-171-A5::KUC105577N::cid_3537054
SMILES C(Sc1nnc(-c2ccncc2)n1Cc1ccco1)c1ccccc1
InChI Key InChIKey=HCHXYHWGEIGZPZ-UHFFFAOYSA-N
Data  1 EC50
  Tab Delimited (TSV)   2D SDfile   Computed 3D by Vconf -m prep SDfile
Find this compound or compounds like it in BindingDB:
Activity Spreadsheet -- Enzyme Inhibition Constant Data from BindingDB
Found 1 hit for monomerid = 75415
TargetKappa-type opioid receptor(Homo sapiens (Human))
Burnham Center For Chemical Genomics
Curated by PubChem BioAssay
LigandPNGBDBM75415(4-[4-(2-furanylmethyl)-5-(phenylmethylthio)-1,2,4-...)
Affinity DataEC50: >2.00E+4nM. Assay description: Data Source: Sanford-Burnham Center for Chemical Genomics (SBCCG) Source Affiliation: Sanford-Burnham Medical Research Institute (SBMRI, San Diego, C...
In DepthDetails PCBioAssay