BDBM75463 11-indeno[1,2-b]quinoxalinone::MLS000067615::SMR000115871::cid_23386::indeno[1,2-b]quinoxalin-11-one
SMILES O=C1c2ccccc2-c2nc3ccccc3nc12
InChI Key InChIKey=GUGBQOJXKJAMTE-UHFFFAOYSA-N
Data  3 IC50  2 EC50
  Tab Delimited (TSV)   2D SDfile   Computed 3D by Vconf -m prep SDfile
Find this compound or compounds like it in BindingDB:
Activity Spreadsheet -- Enzyme Inhibition Constant Data from BindingDB
Found 5 hits for monomerid = 75463
TargetNuclear receptor subfamily 1 group I member 2(Homo sapiens (Human))
The Scripps Research Institute Molecular Screening Center
Curated by PubChem BioAssay
LigandPNGBDBM75463(11-indeno[1,2-b]quinoxalinone | MLS000067615 | SMR...)
Affinity DataEC50: >1.16E+5nM. Assay description: Source (MLPCN Center Name): The Scripps Research Institute Molecular Screening Center (SRIMSC) Center Affiliation: The Scripps Research Institute (TS...
In DepthDetails PCBioAssay
TargetAryl hydrocarbon receptor(Homo sapiens (Human))
The Scripps Research Institute Molecular Screening Center
Curated by PubChem BioAssay
LigandPNGBDBM75463(11-indeno[1,2-b]quinoxalinone | MLS000067615 | SMR...)
Affinity DataEC50:  1.22E+3nM. Assay description: Source (MLPCN Center Name): The Scripps Research Institute Molecular Screening Center (SRIMSC) Center Affiliation: The Scripps Research Institute (TS...
In DepthDetails PCBioAssay
TargetOligo-1,6-glucosidase IMA1(Saccharomyces cerevisiae S288c (Baker's yeast))
University Of The Punjab
Curated by ChEMBL
LigandPNGBDBM75463(11-indeno[1,2-b]quinoxalinone | MLS000067615 | SMR...)
Affinity DataIC50:  6.25E+4nM. Assay description: Inhibition of Saccharomyces cerevisiae alpha-glucosidase using p-nitrophenyl-alpha-D-glucopyranoside as substrate preincubated for 10 mins measured a...
In DepthDetails ArticlePubMed
TargetSentrin-specific protease 8(Homo sapiens (Human))
Burnham Center For Chemical Genomics
Curated by PubChem BioAssay
LigandPNGBDBM75463(11-indeno[1,2-b]quinoxalinone | MLS000067615 | SMR...)
Affinity DataIC50:  5.17E+3nM
In DepthDetails PCBioAssay
TargetSentrin-specific protease 8(Homo sapiens (Human))
Burnham Center For Chemical Genomics
Curated by PubChem BioAssay
LigandPNGBDBM75463(11-indeno[1,2-b]quinoxalinone | MLS000067615 | SMR...)
Affinity DataIC50:  5.17E+3nM
In DepthDetails PCBioAssay