BDBM75562 KSC-11-86-1::KUC104619N::N-[2-[methyl-[(1R)-1-phenylethyl]amino]ethyl]-4-[(tosylamino)methyl]benzamide::N-[2-[methyl-[(1R)-1-phenylethyl]amino]ethyl]-4-[[(4-methylphenyl)sulfonylamino]methyl]benzamide::cid_44968270
SMILES C[C@@H](N(C)CCNC(=O)c1ccc(CNS(=O)(=O)c2ccc(C)cc2)cc1)c1ccccc1
InChI Key InChIKey=FBWNVAIYJHOLGJ-OAQYLSRUSA-N
Data  2 IC50
  Tab Delimited (TSV)   2D SDfile   Computed 3D by Vconf -m prep SDfile
Find this compound or compounds like it in BindingDB:
Activity Spreadsheet -- Enzyme Inhibition Constant Data from BindingDB
Found 2 hits for monomerid = 75562
TargetKappa-type opioid receptor(Homo sapiens (Human))
Burnham Center For Chemical Genomics
Curated by PubChem BioAssay
LigandPNGBDBM75562(KSC-11-86-1 | KUC104619N | N-[2-[methyl-[(1R)-1-ph...)
Affinity DataIC50:  2.40E+3nM. Assay description: Data Source: Sanford-Burnham Center for Chemical Genomics (SBCCG) Source Affiliation: Sanford-Burnham Medical Research Institute (SBMRI, San Diego, C...
In DepthDetails PCBioAssay
TargetKappa-type opioid receptor(Homo sapiens (Human))
Burnham Center For Chemical Genomics
Curated by PubChem BioAssay
LigandPNGBDBM75562(KSC-11-86-1 | KUC104619N | N-[2-[methyl-[(1R)-1-ph...)
Affinity DataIC50:  3.38E+3nM. Assay description: Data Source: Burnham Center for Chemical Genomics (BCCG) Source Affiliation: Burnham Institute for Medical Research (BIMR, La Jolla, CA) Network: NIH...
In DepthDetails PCBioAssay