BDBM75685 2-(1-bromanylnaphthalen-2-yl)oxy-1-piperidin-1-yl-ethanone::2-(1-bromo-2-naphthoxy)-1-piperidino-ethanone::2-(1-bromonaphthalen-2-yl)oxy-1-piperidin-1-ylethanone::2-[(1-bromo-2-naphthalenyl)oxy]-1-(1-piperidinyl)ethanone::MLS001035339::SMR000664549::cid_675984
SMILES Brc1c(OCC(=O)N2CCCCC2)ccc2ccccc12
InChI Key InChIKey=PMIRSUMMDKSKOB-UHFFFAOYSA-N
Data  1 EC50
  Tab Delimited (TSV)   2D SDfile   Computed 3D by Vconf -m prep SDfile
Find this compound or compounds like it in BindingDB:
Activity Spreadsheet -- Enzyme Inhibition Constant Data from BindingDB
Found 1 hit for monomerid = 75685
TargetIntestinal-type alkaline phosphatase(Homo sapiens (Human))
Burnham Center For Chemical Genomics
Curated by PubChem BioAssay
LigandPNGBDBM75685(2-(1-bromanylnaphthalen-2-yl)oxy-1-piperidin-1-yl-...)
Affinity DataEC50: >1.00E+5nM. Assay description: Data Source: Sanford-Burnham Center for Chemical Genomics (SBCCG) Source Affiliation: Sanford-Burnham Medical Research Institute (SBMRI, San Diego, C...
In DepthDetails PCBioAssay