BDBM75720 3-[4-(5-chloranyl-2-methoxy-phenyl)sulfonylpiperazin-1-yl]-N-(4-methoxyphenyl)propanamide::3-[4-(5-chloro-2-methoxy-phenyl)sulfonylpiperazino]-N-(4-methoxyphenyl)propionamide::3-[4-(5-chloro-2-methoxyphenyl)sulfonyl-1-piperazinyl]-N-(4-methoxyphenyl)propanamide::3-[4-(5-chloro-2-methoxyphenyl)sulfonylpiperazin-1-yl]-N-(4-methoxyphenyl)propanamide::3-{4-[(5-chloro-2-methoxyphenyl)sulfonyl]piperazin-1-yl}-N-(4-methoxyphenyl)propanamide::MLS000047497::SMR000033508::cid_3236122
SMILES COc1ccc(NC(=O)CCN2CCN(CC2)S(=O)(=O)c2cc(Cl)ccc2OC)cc1
InChI Key InChIKey=BRQHRNXSACRNKG-UHFFFAOYSA-N
Data  1 IC50
  Tab Delimited (TSV)   2D SDfile   Computed 3D by Vconf -m prep SDfile
Find this compound or compounds like it in BindingDB:
Activity Spreadsheet -- Enzyme Inhibition Constant Data from BindingDB
Found 1 hit for monomerid = 75720
TargetIntestinal-type alkaline phosphatase(Homo sapiens (Human))
Burnham Center For Chemical Genomics
Curated by PubChem BioAssay
LigandPNGBDBM75720(3-[4-(5-chloranyl-2-methoxy-phenyl)sulfonylpiperaz...)
Affinity DataIC50: >1.00E+5nM. Assay description: Data Source: Sanford-Burnham Center for Chemical Genomics (SBCCG) Source Affiliation: Sanford-Burnham Medical Research Institute (SBMRI, San Diego, C...
In DepthDetails PCBioAssay