BDBM75730 2-amino-N-(2-methylbenzyl)benzamide::2-amino-N-[(2-methylphenyl)methyl]benzamide::2-azanyl-N-[(2-methylphenyl)methyl]benzamide::MLS000538317::SMR000144354::cid_1265761
SMILES Cc1ccccc1CNC(=O)c1ccccc1N
InChI Key InChIKey=XHBFBMXITVTRGL-UHFFFAOYSA-N
Data  1 IC50  1 EC50
  Tab Delimited (TSV)   2D SDfile   Computed 3D by Vconf -m prep SDfile
Find this compound or compounds like it in BindingDB:
Activity Spreadsheet -- Enzyme Inhibition Constant Data from BindingDB
Found 2 hits for monomerid = 75730
TargetCorticotropin-releasing factor-binding protein(Homo sapiens (Human))
Burnham Center For Chemical Genomics
Curated by PubChem BioAssay
LigandPNGBDBM75730(2-amino-N-(2-methylbenzyl)benzamide | 2-amino-N-[(...)
Affinity DataEC50: >5.30E+4nM. Assay description: Data Source: Sanford-Burnham Center for Chemical Genomics (SBCCG) Source Affiliation: Sanford-Burnham Medical Research Institute (SBMRI, San Diego, C...
In DepthDetails PCBioAssay
TargetIntestinal-type alkaline phosphatase(Homo sapiens (Human))
Burnham Center For Chemical Genomics
Curated by PubChem BioAssay
LigandPNGBDBM75730(2-amino-N-(2-methylbenzyl)benzamide | 2-amino-N-[(...)
Affinity DataIC50: >1.00E+5nM. Assay description: Data Source: Sanford-Burnham Center for Chemical Genomics (SBCCG) Source Affiliation: Sanford-Burnham Medical Research Institute (SBMRI, San Diego, C...
In DepthDetails PCBioAssay