BDBM75800 (E)-3-[5-(4-chlorophenyl)-2-furanyl]-2-cyano-N-(1,5-dimethyl-3-oxo-2-phenyl-4-pyrazolyl)-2-propenamide::(E)-3-[5-(4-chlorophenyl)-2-furyl]-2-cyano-N-(3-keto-1,5-dimethyl-2-phenyl-3-pyrazolin-4-yl)acrylamide::(E)-3-[5-(4-chlorophenyl)furan-2-yl]-2-cyano-N-(1,5-dimethyl-3-oxidanylidene-2-phenyl-pyrazol-4-yl)prop-2-enamide::(E)-3-[5-(4-chlorophenyl)furan-2-yl]-2-cyano-N-(1,5-dimethyl-3-oxo-2-phenylpyrazol-4-yl)prop-2-enamide::3-[5-(4-Chloro-phenyl)-furan-2-yl]-2-cyano-N-(1,5-dimethyl-3-oxo-2-phenyl-2,3-dihydro-1H-pyrazol-4-yl)-acrylamide::MLS000563274::SMR000176061::cid_1106185
SMILES Cc1c(NC(=O)C(=C\c2ccc(o2)-c2ccc(Cl)cc2)\C#N)c(=O)n(-c2ccccc2)n1C
InChI Key InChIKey=SRAFPBCBBXARPY-NBVRZTHBSA-N
Data  1 IC50
  Tab Delimited (TSV)   2D SDfile   Computed 3D by Vconf -m prep SDfile
Find this compound or compounds like it in BindingDB:
Activity Spreadsheet -- Enzyme Inhibition Constant Data from BindingDB
Found 1 hit for monomerid = 75800
TargetInsulin-degrading enzyme(Homo sapiens (Human))
The Scripps Research Institute Molecular Screening Center
Curated by PubChem BioAssay
LigandPNGBDBM75800((E)-3-[5-(4-chlorophenyl)-2-furanyl]-2-cyano-N-(1,...)
Affinity DataIC50:  2.70E+3nM. Assay description: Source (MLPCN Center Name): The Scripps Research Institute Molecular Screening Center (SRIMSC) Center Affiliation: The Scripps Research Institute (TS...
In DepthDetails PCBioAssay