BDBM75943 2-[3,5-bis(trifluoromethyl)phenyl]-5-chloranyl-4-(4-methoxyphenoxy)pyridazin-3-one::2-[3,5-bis(trifluoromethyl)phenyl]-5-chloro-4-(4-methoxyphenoxy)-3-pyridazinone::2-[3,5-bis(trifluoromethyl)phenyl]-5-chloro-4-(4-methoxyphenoxy)pyridazin-3-one::SR-02000000479::SR-02000000479-1::cid_46850894
SMILES COc1ccc(Oc2c(Cl)cnn(-c3cc(cc(c3)C(F)(F)F)C(F)(F)F)c2=O)cc1
InChI Key InChIKey=GOARAQLEDKRNQJ-UHFFFAOYSA-N
Data  2 IC50
  Tab Delimited (TSV)   2D SDfile   Computed 3D by Vconf -m prep SDfile
Find this compound or compounds like it in BindingDB:
Activity Spreadsheet -- Enzyme Inhibition Constant Data from BindingDB
Found 2 hits for monomerid = 75943
TargetNeuropeptides B/W receptor type 1(Homo sapiens (Human))
The Scripps Research Institute Molecular Screening Center
Curated by PubChem BioAssay
LigandPNGBDBM75943(2-[3,5-bis(trifluoromethyl)phenyl]-5-chloranyl-4-(...)
Affinity DataIC50:  1.20E+3nM. Assay description: Source (MLPCN Center Name): The Scripps Research Institute Molecular Screening Center (SRIMSC) Affiliation: The Scripps Research Institute, TSRI Assa...
In DepthDetails PCBioAssay
TargetMelanin-concentrating hormone receptor 1(Homo sapiens (Human))
The Scripps Research Institute Molecular Screening Center
Curated by PubChem BioAssay
LigandPNGBDBM75943(2-[3,5-bis(trifluoromethyl)phenyl]-5-chloranyl-4-(...)
Affinity DataIC50:  1.50E+3nM. Assay description: Source (MLPCN Center Name): The Scripps Research Institute Molecular Screening Center (SRIMSC) Affiliation: The Scripps Research Institute, TSRI Assa...
In DepthDetails PCBioAssay