BDBM75948 SR-02000000484::SR-02000000484-1::[1-(4-chlorobenzyl)-2-piperidyl]-[4-(4-nitrophenyl)piperazino]methanone::[1-[(4-chlorophenyl)methyl]-2-piperidinyl]-[4-(4-nitrophenyl)-1-piperazinyl]methanone::[1-[(4-chlorophenyl)methyl]piperidin-2-yl]-[4-(4-nitrophenyl)piperazin-1-yl]methanone::cid_46850892
SMILES [O-][N+](=O)c1ccc(cc1)N1CCN(CC1)C(=O)C1CCCCN1Cc1ccc(Cl)cc1
InChI Key InChIKey=KYMSQAJQZFABLS-UHFFFAOYSA-N
Data  2 IC50
  Tab Delimited (TSV)   2D SDfile   Computed 3D by Vconf -m prep SDfile
Find this compound or compounds like it in BindingDB:
Activity Spreadsheet -- Enzyme Inhibition Constant Data from BindingDB
Found 2 hits for monomerid = 75948
TargetNeuropeptides B/W receptor type 1(Homo sapiens (Human))
The Scripps Research Institute Molecular Screening Center
Curated by PubChem BioAssay
LigandPNGBDBM75948(SR-02000000484 | SR-02000000484-1 | [1-(4-chlorobe...)
Affinity DataIC50:  1.60E+3nM. Assay description: Source (MLPCN Center Name): The Scripps Research Institute Molecular Screening Center (SRIMSC) Affiliation: The Scripps Research Institute, TSRI Assa...
In DepthDetails PCBioAssay
TargetMelanin-concentrating hormone receptor 1(Homo sapiens (Human))
The Scripps Research Institute Molecular Screening Center
Curated by PubChem BioAssay
LigandPNGBDBM75948(SR-02000000484 | SR-02000000484-1 | [1-(4-chlorobe...)
Affinity DataIC50:  1.80E+3nM. Assay description: Source (MLPCN Center Name): The Scripps Research Institute Molecular Screening Center (SRIMSC) Affiliation: The Scripps Research Institute, TSRI Assa...
In DepthDetails PCBioAssay