BDBM75952 5-chloranyl-4-[(3,4-diethoxyphenyl)methoxy]-2-(4-methylphenyl)pyridazin-3-one::5-chloro-4-(3,4-diethoxybenzyl)oxy-2-(p-tolyl)pyridazin-3-one::5-chloro-4-[(3,4-diethoxyphenyl)methoxy]-2-(4-methylphenyl)-3-pyridazinone::5-chloro-4-[(3,4-diethoxyphenyl)methoxy]-2-(4-methylphenyl)pyridazin-3-one::SR-02000000340::SR-02000000340-1::cid_45382319
SMILES CCOc1ccc(COc2c(Cl)cnn(-c3ccc(C)cc3)c2=O)cc1OCC
InChI Key InChIKey=FTIHCAKXNQBAPH-UHFFFAOYSA-N
Data  1 IC50
  Tab Delimited (TSV)   2D SDfile   Computed 3D by Vconf -m prep SDfile
Find this compound or compounds like it in BindingDB:
Activity Spreadsheet -- Enzyme Inhibition Constant Data from BindingDB
Found 1 hit for monomerid = 75952
TargetNeuropeptides B/W receptor type 1(Homo sapiens (Human))
The Scripps Research Institute Molecular Screening Center
Curated by PubChem BioAssay
LigandPNGBDBM75952(5-chloranyl-4-[(3,4-diethoxyphenyl)methoxy]-2-(4-m...)
Affinity DataIC50: >2.00E+4nM. Assay description: Source (MLPCN Center Name): The Scripps Research Institute Molecular Screening Center (SRIMSC) Affiliation: The Scripps Research Institute, TSRI Assa...
In DepthDetails PCBioAssay