BDBM76002 MLS000859203::N-(4-chlorophenyl)-5-(2-pyridinyl)-2-thiophenecarboxamide::N-(4-chlorophenyl)-5-(2-pyridyl)thiophene-2-carboxamide::N-(4-chlorophenyl)-5-pyridin-2-yl-thiophene-2-carboxamide::N-(4-chlorophenyl)-5-pyridin-2-ylthiophene-2-carboxamide::SMR000459382::cid_2819703
SMILES Clc1ccc(NC(=O)c2ccc(s2)-c2ccccn2)cc1
InChI Key InChIKey=IFNXTTSMUGZXCH-UHFFFAOYSA-N
Data  2 IC50
  Tab Delimited (TSV)   2D SDfile   Computed 3D by Vconf -m prep SDfile
Find this compound or compounds like it in BindingDB:
Activity Spreadsheet -- Enzyme Inhibition Constant Data from BindingDB
Found 2 hits for monomerid = 76002
TargetPhotoreceptor-specific nuclear receptor(Homo sapiens (Human))
The Scripps Research Institute Molecular Screening Center
Curated by PubChem BioAssay
LigandPNGBDBM76002(MLS000859203 | N-(4-chlorophenyl)-5-(2-pyridinyl)-...)
Affinity DataIC50:  8.84E+3nM. Assay description: Source (MLPCN Center Name): The Scripps Research Institute Molecular Screening Center Affiliation: The Scripps Research Institute, TSRI Assay Provide...
In DepthDetails PCBioAssay
TargetIsoform 2 of Nuclear receptor corepressor 2 (TRAC-1)(Homo sapiens (Human))
The Scripps Research Institute Molecular Screening Center
Curated by PubChem BioAssay
LigandPNGBDBM76002(MLS000859203 | N-(4-chlorophenyl)-5-(2-pyridinyl)-...)
Affinity DataIC50:  1.09E+4nM. Assay description: Source (MLPCN Center Name): The Scripps Research Institute Molecular Screening Center Affiliation: The Scripps Research Institute, TSRI Assay Provide...
In DepthDetails PCBioAssay