BDBM76074 1-cyclopentyl-2-imino-5-oxo-N-propan-2-yl-3-dipyrido[1,2-d:3',4'-f]pyrimidinecarboxamide::1-cyclopentyl-2-imino-5-oxo-N-propan-2-yldipyrido[1,2-d:3',4'-f]pyrimidine-3-carboxamide::1-cyclopentyl-2-imino-N-isopropyl-5-keto-dipyrido[1,2-d:3',4'-f]pyrimidine-3-carboxamide::2-azanylidene-1-cyclopentyl-5-oxidanylidene-N-propan-2-yl-dipyrido[1,2-d:3',4'-f]pyrimidine-3-carboxamide::MLS-0437217.0001::cid_3785326
SMILES CC(C)NC(=O)c1cc2c(nc3ccccn3c2=O)n(C2CCCC2)c1=N
InChI Key InChIKey=LCXWTFPJLNYDHR-UHFFFAOYSA-N
Data  4 IC50  3 EC50
  Tab Delimited (TSV)   2D SDfile   Computed 3D by Vconf -m prep SDfile
Find this compound or compounds like it in BindingDB:
Activity Spreadsheet -- Enzyme Inhibition Constant Data from BindingDB
Found 7 hits for monomerid = 76074
TargetCannabinoid receptor 2(Homo sapiens (Human))
Burnham Center For Chemical Genomics
Curated by PubChem BioAssay
LigandPNGBDBM76074(1-cyclopentyl-2-imino-5-oxo-N-propan-2-yl-3-dipyri...)
Affinity DataEC50:  9.06E+3nM. Assay description: Data Source: Sanford-Burnham Center for Chemical Genomics Source Affiliation: Sanford-Burnham Medical Research Institute (SBMRI, San Diego, CA) Netw...
In DepthDetails PCBioAssay
TargetCannabinoid receptor 2(Homo sapiens (Human))
Burnham Center For Chemical Genomics
Curated by PubChem BioAssay
LigandPNGBDBM76074(1-cyclopentyl-2-imino-5-oxo-N-propan-2-yl-3-dipyri...)
Affinity DataIC50: >3.20E+4nM. Assay description: Data Source: Sanford-Burnham Center for Chemical Genomics Source Affiliation: Sanford-Burnham Medical Research Institute (SBMRI, San Diego, CA) Netw...
In DepthDetails PCBioAssay
TargetCannabinoid receptor 1(Homo sapiens (Human))
Burnham Center For Chemical Genomics
Curated by PubChem BioAssay
LigandPNGBDBM76074(1-cyclopentyl-2-imino-5-oxo-N-propan-2-yl-3-dipyri...)
Affinity DataEC50: >3.20E+4nM. Assay description: Data Source: Sanford-Burnham Center for Chemical Genomics Source Affiliation: Sanford-Burnham Medical Research Institute (SBMRI, San Diego) Network...
In DepthDetails PCBioAssay
TargetG-protein coupled receptor 55(Homo sapiens (Human))
Burnham Center For Chemical Genomics
Curated by PubChem BioAssay
LigandPNGBDBM76074(1-cyclopentyl-2-imino-5-oxo-N-propan-2-yl-3-dipyri...)
Affinity DataIC50: >3.20E+4nM. Assay description: Data Source: Sanford-Burnham Center for Chemical Genomics(SBCCG) Source Affiliation: Sanford-Burnham Medical Research Institute (SBMRI, San Diego, C...
In DepthDetails PCBioAssay
TargetCannabinoid receptor 1(Homo sapiens (Human))
Burnham Center For Chemical Genomics
Curated by PubChem BioAssay
LigandPNGBDBM76074(1-cyclopentyl-2-imino-5-oxo-N-propan-2-yl-3-dipyri...)
Affinity DataIC50: >3.20E+4nM. Assay description: Data Source: Sanford-Burnham Center for Chemical Genomics Source Affiliation: Sanford-Burnham Medical Research Institute (SBMRI, San Diego) Network...
In DepthDetails PCBioAssay
TargetG-protein coupled receptor 35(Homo sapiens (Human))
Burnham Center For Chemical Genomics
Curated by PubChem BioAssay
LigandPNGBDBM76074(1-cyclopentyl-2-imino-5-oxo-N-propan-2-yl-3-dipyri...)
Affinity DataEC50: >3.20E+4nM. Assay description: Data Source: Sanford-Burnham Center for Chemical Genomics Source Affiliation: Sanford-Burnham Medical Research Institute Network: NIH Molecular Libr...
In DepthDetails PCBioAssay
TargetG-protein coupled receptor 35(Homo sapiens (Human))
Burnham Center For Chemical Genomics
Curated by PubChem BioAssay
LigandPNGBDBM76074(1-cyclopentyl-2-imino-5-oxo-N-propan-2-yl-3-dipyri...)
Affinity DataIC50: >3.20E+4nM. Assay description: Data Source: Sanford-Burnham Center for Chemical Genomics (SBCCG) Source Affiliation: Sanford-Burnham Medical Research Institute (SBMRI, San Diego, C...
In DepthDetails PCBioAssay