BDBM76095 4-(4-hydroxyphenoxy)phenol::4-(4-oxidanylphenoxy)phenol::KSC-19-056::KUC106452N::US9688816, C::cid_16069
SMILES Oc1ccc(Oc2ccc(O)cc2)cc1
InChI Key InChIKey=NZGQHKSLKRFZFL-UHFFFAOYSA-N
Data  3 IC50
  Tab Delimited (TSV)   2D SDfile   Computed 3D by Vconf -m prep SDfile
Find this compound or compounds like it in BindingDB:
Activity Spreadsheet -- Enzyme Inhibition Constant Data from BindingDB
Found 3 hits for monomerid = 76095
TargetLarge T antigen(Simian virus 40)
Southern Research Specialized Biocontainment Screening Center
Curated by PubChem BioAssay
LigandPNGBDBM76095(4-(4-hydroxyphenoxy)phenol | 4-(4-oxidanylphenoxy)...)
Affinity DataIC50:  3.77E+4nM. Assay description: Southern Research's Specialized Biocontainment Screening Center (SRSBSC) Southern Research Institute (Birmingham, Alabama) NIH Molecular Librarie...
In DepthDetails PCBioAssay
TargetEstrogen receptor beta(Homo sapiens (Human))
Sabic Global Technologies
US Patent
LigandPNGBDBM76095(4-(4-hydroxyphenoxy)phenol | 4-(4-oxidanylphenoxy)...)
Affinity DataIC50:  1.40E+4nM. Assay description: Competitive binding assays were performed by incubating rhER alpha (α) and beta 1 (β1) receptors with 10 nM [3H]estradiol (the radio ligand...
In DepthDetails US Patent
TargetEstrogen receptor(Homo sapiens (Human))
Sabic Global Technologies
US Patent
LigandPNGBDBM76095(4-(4-hydroxyphenoxy)phenol | 4-(4-oxidanylphenoxy)...)
Affinity DataIC50:  6.00E+4nM. Assay description: Competitive binding assays were performed by incubating rhER alpha (α) and beta 1 (β1) receptors with 10 nM [3H]estradiol (the radio ligand...
In DepthDetails US Patent