BDBM76126 (3-butyl-7-methyl-6,8-dioxo-2-phenylisoquinolin-7-yl) propanoate::CMLD003542::MLS000438571::SMR000452623::[3-butyl-7-methyl-6,8-bis(oxidanylidene)-2-phenyl-isoquinolin-7-yl] propanoate::cid_16745561::propanoic acid (3-butyl-7-methyl-6,8-dioxo-2-phenyl-7-isoquinolinyl) ester::propionic acid (3-butyl-6,8-diketo-7-methyl-2-phenyl-7-isoquinolyl) ester
SMILES CCCCC1=CC2=CC(=O)C(C)(OC(=O)CC)C(=O)C2=CN1c1ccccc1
InChI Key InChIKey=CFIHYMXDIHOLKK-UHFFFAOYSA-N
Data  2 EC50
  Tab Delimited (TSV)   2D SDfile   Computed 3D by Vconf -m prep SDfile
Find this compound or compounds like it in BindingDB:
Activity Spreadsheet -- Enzyme Inhibition Constant Data from BindingDB
Found 2 hits for monomerid = 76126
TargetApelin receptor(Homo sapiens (Human))
Burnham Center For Chemical Genomics
Curated by PubChem BioAssay
LigandPNGBDBM76126((3-butyl-7-methyl-6,8-dioxo-2-phenylisoquinolin-7-...)
Affinity DataEC50: >1.00E+5nM. Assay description: Data Source: Sanford-Burnham Center for Chemical Genomics (SBCCG) Source Affiliation: Sanford-Burnham Medical Research Institute(SBMRI, San Diego) Ne...
In DepthDetails PCBioAssay
TargetType-1 angiotensin II receptor(Homo sapiens (Human))
Burnham Center For Chemical Genomics
Curated by PubChem BioAssay
LigandPNGBDBM76126((3-butyl-7-methyl-6,8-dioxo-2-phenylisoquinolin-7-...)
Affinity DataEC50: >1.00E+5nM. Assay description: Data Source: Sanford-Burnham Center for Chemical Genomics (SBCCG) Source Affiliation: Sanford-Burnham Medical Research Institute(SBMRI, San Diego) Ne...
In DepthDetails PCBioAssay