BDBM76335 MLS000672558::N-[4-(difluoromethoxy)phenyl]-6-methyl-2-(4-pyridinyl)-4-quinolinecarboxamide::N-[4-(difluoromethoxy)phenyl]-6-methyl-2-(4-pyridyl)cinchoninamide::N-[4-(difluoromethoxy)phenyl]-6-methyl-2-pyridin-4-yl-4-quinolinecarboxamide::N-[4-(difluoromethoxy)phenyl]-6-methyl-2-pyridin-4-ylquinoline-4-carboxamide::N-[4-[bis(fluoranyl)methoxy]phenyl]-6-methyl-2-pyridin-4-yl-quinoline-4-carboxamide::SMR000295431::cid_1261372
SMILES Cc1ccc2nc(cc(C(=O)Nc3ccc(OC(F)F)cc3)c2c1)-c1ccncc1
InChI Key InChIKey=CXVCDUVJMVNJFG-UHFFFAOYSA-N
Data  2 IC50
  Tab Delimited (TSV)   2D SDfile   Computed 3D by Vconf -m prep SDfile
Find this compound or compounds like it in BindingDB:
Activity Spreadsheet -- Enzyme Inhibition Constant Data from BindingDB
Found 2 hits for monomerid = 76335
TargetDual specificity protein phosphatase 3(Homo sapiens (Human))
Burnham Center For Chemical Genomics
Curated by PubChem BioAssay
LigandPNGBDBM76335(MLS000672558 | N-[4-(difluoromethoxy)phenyl]-6-met...)
Affinity DataIC50:  5.69E+3nM. Assay description: Data Source: Sanford-Burnham Center for Chemical Genomics (SBCCG) Source Affiliation: Sanford-Burnham Medical Research Institute (SBMRI, San Diego, C...
In DepthDetails PCBioAssay
TargetTyrosine-protein phosphatase non-receptor type 7(Homo sapiens (Human))
Burnham Center For Chemical Genomics
Curated by PubChem BioAssay
LigandPNGBDBM76335(MLS000672558 | N-[4-(difluoromethoxy)phenyl]-6-met...)
Affinity DataIC50:  4.12E+3nM. Assay description: Data Source: Sanford-Burnham Center for Chemical Genomics (SBCCG) Source Affiliation: Sanford-Burnham Medical Research Institute (SBMRI, San Diego, C...
In DepthDetails PCBioAssay