BDBM76424 4-[(2-fluorophenyl)hydrazinylidene]-5-imino-1-phenyl-3-pyrazolidinone::4-[(2-fluorophenyl)hydrazinylidene]-5-imino-1-phenylpyrazolidin-3-one::4-[(2-fluorophenyl)hydrazono]-5-imino-1-phenyl-pyrazolidin-3-one::5-amino-4-[(2-fluorophenyl)diazenyl]-1-phenyl-1,2-dihydro-3H-pyrazol-3-one::5-azanylidene-4-[(2-fluorophenyl)hydrazinylidene]-1-phenyl-pyrazolidin-3-one::MLS000538801::SMR000161336::cid_7313791
SMILES Nc1c(N=Nc2ccccc2F)c(=O)[nH]n1-c1ccccc1
InChI Key InChIKey=OOIJLCGDBRLXTC-VHEBQXMUSA-N
Data  3 IC50
  Tab Delimited (TSV)   2D SDfile   Computed 3D by Vconf -m prep SDfile
Find this compound or compounds like it in BindingDB:
Activity Spreadsheet -- Enzyme Inhibition Constant Data from BindingDB
Found 3 hits for monomerid = 76424
TargetSentrin-specific protease 8(Homo sapiens (Human))
Burnham Center For Chemical Genomics
Curated by PubChem BioAssay
LigandPNGBDBM76424(4-[(2-fluorophenyl)hydrazinylidene]-5-imino-1-phen...)
Affinity DataIC50: >1.00E+5nM. Assay description: Data Source: Sanford-Burnham Center for Chemical Genomics (SBCCG) Source Affiliation: Sanford-Burnham Medical Research Institute (SBMRI, San Diego, C...
In DepthDetails PCBioAssay
TargetCaspase-3(Homo sapiens (Human))
Burnham Center For Chemical Genomics
Curated by PubChem BioAssay
LigandPNGBDBM76424(4-[(2-fluorophenyl)hydrazinylidene]-5-imino-1-phen...)
Affinity DataIC50:  1.64E+4nM. Assay description: Data Source: Sanford-Burnham Center for Chemical Genomics (SBCCG) Source Affiliation: Sanford-Burnham Medical Research Institute (SBMRI, San Diego, C...
In DepthDetails PCBioAssay
TargetSentrin-specific protease 6(Homo sapiens (Human))
Burnham Center For Chemical Genomics
Curated by PubChem BioAssay
LigandPNGBDBM76424(4-[(2-fluorophenyl)hydrazinylidene]-5-imino-1-phen...)
Affinity DataIC50:  2.09E+3nM. Assay description: Data Source: Sanford-Burnham Center for Chemical Genomics (SBCCG) Source Affiliation: Sanford-Burnham Medical Research Institute (SBMRI, San Diego, C...
In DepthDetails PCBioAssay