BDBM76497 5-nitro-2-thiophenecarboxylic acid [2-[(4-fluorophenyl)methylamino]-2-oxoethyl] ester::5-nitrothiophene-2-carboxylic acid [2-[(4-fluorobenzyl)amino]-2-keto-ethyl] ester::MLS000392456::SMR000261353::[2-[(4-fluorophenyl)methylamino]-2-oxidanylidene-ethyl] 5-nitrothiophene-2-carboxylate::[2-[(4-fluorophenyl)methylamino]-2-oxoethyl] 5-nitrothiophene-2-carboxylate::cid_2401181
SMILES [O-][N+](=O)c1ccc(s1)C(=O)OCC(=O)NCc1ccc(F)cc1
InChI Key InChIKey=VPOJISYAKDCGDO-UHFFFAOYSA-N
Data  3 IC50  1 EC50
  Tab Delimited (TSV)   2D SDfile   Computed 3D by Vconf -m prep SDfile
Find this compound or compounds like it in BindingDB:
Activity Spreadsheet -- Enzyme Inhibition Constant Data from BindingDB
Found 4 hits for monomerid = 76497
TargetSentrin-specific protease 8(Homo sapiens (Human))
Burnham Center For Chemical Genomics
Curated by PubChem BioAssay
LigandPNGBDBM76497(5-nitro-2-thiophenecarboxylic acid [2-[(4-fluoroph...)
Affinity DataIC50:  3.72E+3nM. Assay description: Data Source: Sanford-Burnham Center for Chemical Genomics (SBCCG) Source Affiliation: Sanford-Burnham Medical Research Institute (SBMRI, San Diego, C...
In DepthDetails PCBioAssay
TargetMitochondrial peptide methionine sulfoxide reductase(Bos taurus)
The Scripps Research Institute Molecular Screening Center
Curated by PubChem BioAssay
LigandPNGBDBM76497(5-nitro-2-thiophenecarboxylic acid [2-[(4-fluoroph...)
Affinity DataEC50:  2.72E+4nM. Assay description: Source (MLPCN Center Name): The Scripps Research Institute Molecular Screening Center (SRIMSC) Affiliation: The Scripps Research Institute, TSRI Assa...
In DepthDetails PCBioAssay
TargetCaspase-3(Homo sapiens (Human))
Burnham Center For Chemical Genomics
Curated by PubChem BioAssay
LigandPNGBDBM76497(5-nitro-2-thiophenecarboxylic acid [2-[(4-fluoroph...)
Affinity DataIC50:  9.32E+3nM. Assay description: Data Source: Sanford-Burnham Center for Chemical Genomics (SBCCG) Source Affiliation: Sanford-Burnham Medical Research Institute (SBMRI, San Diego, C...
In DepthDetails PCBioAssay
TargetSentrin-specific protease 6(Homo sapiens (Human))
Burnham Center For Chemical Genomics
Curated by PubChem BioAssay
LigandPNGBDBM76497(5-nitro-2-thiophenecarboxylic acid [2-[(4-fluoroph...)
Affinity DataIC50:  3.68E+3nM. Assay description: Data Source: Sanford-Burnham Center for Chemical Genomics (SBCCG) Source Affiliation: Sanford-Burnham Medical Research Institute (SBMRI, San Diego, C...
In DepthDetails PCBioAssay