BDBM76620 3-ethoxy-N-(2-naphthalenyl)benzamide::3-ethoxy-N-(2-naphthyl)benzamide::3-ethoxy-N-2-naphthylbenzamide::3-ethoxy-N-naphthalen-2-yl-benzamide::3-ethoxy-N-naphthalen-2-ylbenzamide::MLS001163504::SMR000496770::cid_875949
SMILES CCOc1cccc(c1)C(=O)Nc1ccc2ccccc2c1
InChI Key InChIKey=LNLJVJHBSBWWRJ-UHFFFAOYSA-N
Data  3 IC50
  Tab Delimited (TSV)   2D SDfile   Computed 3D by Vconf -m prep SDfile
Find this compound or compounds like it in BindingDB:
Activity Spreadsheet -- Enzyme Inhibition Constant Data from BindingDB
Found 3 hits for monomerid = 76620
TargetCaspase-3(Homo sapiens (Human))
Burnham Center For Chemical Genomics
Curated by PubChem BioAssay
LigandPNGBDBM76620(3-ethoxy-N-(2-naphthalenyl)benzamide | 3-ethoxy-N-...)
Affinity DataIC50:  3.54E+3nM. Assay description: Data Source: Sanford-Burnham Center for Chemical Genomics (SBCCG) Source Affiliation: Sanford-Burnham Medical Research Institute (SBMRI, San Diego, C...
In DepthDetails PCBioAssay
TargetSentrin-specific protease 6(Homo sapiens (Human))
Burnham Center For Chemical Genomics
Curated by PubChem BioAssay
LigandPNGBDBM76620(3-ethoxy-N-(2-naphthalenyl)benzamide | 3-ethoxy-N-...)
Affinity DataIC50:  2.37E+3nM. Assay description: Data Source: Sanford-Burnham Center for Chemical Genomics (SBCCG) Source Affiliation: Sanford-Burnham Medical Research Institute (SBMRI, San Diego, C...
In DepthDetails PCBioAssay
TargetSentrin-specific protease 8(Homo sapiens (Human))
Burnham Center For Chemical Genomics
Curated by PubChem BioAssay
LigandPNGBDBM76620(3-ethoxy-N-(2-naphthalenyl)benzamide | 3-ethoxy-N-...)
Affinity DataIC50:  4.95E+3nM. Assay description: Data Source: Sanford-Burnham Center for Chemical Genomics (SBCCG) Source Affiliation: Sanford-Burnham Medical Research Institute (SBMRI, San Diego, C...
In DepthDetails PCBioAssay