BDBM76677 5-Nitro-furan-2-carboxylic acid (6-methoxy-benzothiazol-2-yl)-amide::MLS001203946::N-(6-methoxy-1,3-benzothiazol-2-yl)-5-nitro-2-furamide::N-(6-methoxy-1,3-benzothiazol-2-yl)-5-nitro-2-furancarboxamide::N-(6-methoxy-1,3-benzothiazol-2-yl)-5-nitro-furan-2-carboxamide::N-(6-methoxy-1,3-benzothiazol-2-yl)-5-nitrofuran-2-carboxamide::SMR000515219::cid_952238
SMILES COc1ccc2nc(NC(=O)c3ccc(o3)[N+]([O-])=O)sc2c1
InChI Key InChIKey=GWUVRBRWNNWQJC-UHFFFAOYSA-N
Data  3 IC50
  Tab Delimited (TSV)   2D SDfile   Computed 3D by Vconf -m prep SDfile
Find this compound or compounds like it in BindingDB:
Activity Spreadsheet -- Enzyme Inhibition Constant Data from BindingDB
Found 3 hits for monomerid = 76677
TargetSentrin-specific protease 6(Homo sapiens (Human))
Burnham Center For Chemical Genomics
Curated by PubChem BioAssay
LigandPNGBDBM76677(5-Nitro-furan-2-carboxylic acid (6-methoxy-benzoth...)
Affinity DataIC50:  1.38E+4nM. Assay description: Data Source: Sanford-Burnham Center for Chemical Genomics (SBCCG) Source Affiliation: Sanford-Burnham Medical Research Institute (SBMRI, San Diego, C...
In DepthDetails PCBioAssay
TargetSentrin-specific protease 8(Homo sapiens (Human))
Burnham Center For Chemical Genomics
Curated by PubChem BioAssay
LigandPNGBDBM76677(5-Nitro-furan-2-carboxylic acid (6-methoxy-benzoth...)
Affinity DataIC50:  2.29E+4nM. Assay description: Data Source: Sanford-Burnham Center for Chemical Genomics (SBCCG) Source Affiliation: Sanford-Burnham Medical Research Institute (SBMRI, San Diego, C...
In DepthDetails PCBioAssay
TargetCaspase-3(Homo sapiens (Human))
Burnham Center For Chemical Genomics
Curated by PubChem BioAssay
LigandPNGBDBM76677(5-Nitro-furan-2-carboxylic acid (6-methoxy-benzoth...)
Affinity DataIC50:  2.82E+4nM. Assay description: Data Source: Sanford-Burnham Center for Chemical Genomics (SBCCG) Source Affiliation: Sanford-Burnham Medical Research Institute (SBMRI, San Diego, C...
In DepthDetails PCBioAssay