BDBM76806 MLS000027319::N-(2,3-Dihydro-benzo[1,4]dioxin-6-yl)-2-[4-(1-propyl-1H-benzoimidazol-2-yl)-piperazin-1-yl]-acetamide::N-(2,3-dihydro-1,4-benzodioxin-6-yl)-2-[4-(1-propyl-2-benzimidazolyl)-1-piperazinyl]acetamide;hydrochloride::N-(2,3-dihydro-1,4-benzodioxin-6-yl)-2-[4-(1-propylbenzimidazol-2-yl)piperazin-1-yl]acetamide;hydrochloride::N-(2,3-dihydro-1,4-benzodioxin-6-yl)-2-[4-(1-propylbenzimidazol-2-yl)piperazin-1-yl]ethanamide;hydrochloride::N-(2,3-dihydro-1,4-benzodioxin-6-yl)-2-[4-(1-propylbenzimidazol-2-yl)piperazino]acetamide;hydrochloride::SMR000006441::cid_6602682
SMILES CCCn1c(nc2ccccc12)N1CCN(CC(=O)Nc2ccc3OCCOc3c2)CC1
InChI Key InChIKey=XIAYUDVFTKGRBI-UHFFFAOYSA-N
Data  1 EC50
  Tab Delimited (TSV)   2D SDfile   Computed 3D by Vconf -m prep SDfile
Find this compound or compounds like it in BindingDB:
Activity Spreadsheet -- Enzyme Inhibition Constant Data from BindingDB
Found 1 hit for monomerid = 76806
TargetVoltage-dependent T-type calcium channel subunit alpha-1H(Homo sapiens (Human))
Vanderbilt Screening Center For Gpcrs, Ion Channels And Transporters
Curated by PubChem BioAssay
LigandPNGBDBM76806(MLS000027319 | N-(2,3-Dihydro-benzo[1,4]dioxin-6-y...)
Affinity DataEC50:  3.84E+3nM. Assay description: Assay Provider: Xinmin Xie Assay Provider Affiliation: Bioscience Division, SRI International, Menlo Park, CA Grant Title: HTS Assay for Cav3 T-Type ...
In DepthDetails PCBioAssay