BDBM76811 MLS000030343::N-[[1-(2-methoxyethyl)-1,2,3,4-tetrazol-5-yl]-pyridin-2-yl-methyl]-2-phenyl-N-(thiophen-2-ylmethyl)ethanamine::N-[[1-(2-methoxyethyl)-5-tetrazolyl]-(2-pyridinyl)methyl]-2-phenyl-N-(thiophen-2-ylmethyl)ethanamine::N-[[1-(2-methoxyethyl)tetrazol-5-yl]-pyridin-2-ylmethyl]-2-phenyl-N-(thiophen-2-ylmethyl)ethanamine::SMR000008266::[[1-(2-methoxyethyl)tetrazol-5-yl]-(2-pyridyl)methyl]-phenethyl-(2-thenyl)amine::cid_646772::{[1-(2-Methoxy-ethyl)-1H-tetrazol-5-yl]-pyridin-2-yl-methyl}-phenethyl-thiophen-2-ylmethyl-amine
SMILES COCCn1nnnc1C(N(CCc1ccccc1)Cc1cccs1)c1ccccn1
InChI Key InChIKey=XCGUHXHQWPUCOL-UHFFFAOYSA-N
Data  1 EC50
  Tab Delimited (TSV)   2D SDfile   Computed 3D by Vconf -m prep SDfile
Find this compound or compounds like it in BindingDB:
Activity Spreadsheet -- Enzyme Inhibition Constant Data from BindingDB
Found 1 hit for monomerid = 76811
TargetVoltage-dependent T-type calcium channel subunit alpha-1H(Homo sapiens (Human))
Vanderbilt Screening Center For Gpcrs, Ion Channels And Transporters
Curated by PubChem BioAssay
LigandPNGBDBM76811(MLS000030343 | N-[[1-(2-methoxyethyl)-1,2,3,4-tetr...)
Affinity DataEC50:  4.87E+3nM. Assay description: Assay Provider: Xinmin Xie Assay Provider Affiliation: Bioscience Division, SRI International, Menlo Park, CA Grant Title: HTS Assay for Cav3 T-Type ...
Ligand InfoPC cidPC sid
In DepthDetails PCBioAssay