BDBM76951 4-fluoranyl-N-[2-[3-[2-[(5-methyl-1,2-oxazol-3-yl)amino]-2-oxidanylidene-ethyl]sulfanylindol-1-yl]ethyl]benzamide::4-fluoro-N-[2-[3-[2-[(5-methyl-1,2-oxazol-3-yl)amino]-2-oxoethyl]sulfanylindol-1-yl]ethyl]benzamide::4-fluoro-N-[2-[3-[[2-[(5-methyl-3-isoxazolyl)amino]-2-oxoethyl]thio]-1-indolyl]ethyl]benzamide::4-fluoro-N-[2-[3-[[2-keto-2-[(5-methylisoxazol-3-yl)amino]ethyl]thio]indol-1-yl]ethyl]benzamide::4-fluoro-N-{2-[3-({2-[(5-methylisoxazol-3-yl)amino]-2-oxoethyl}thio)-1H-indol-1-yl]ethyl}benzamide::MLS000086106::SMR000021615::cid_3241455
SMILES Cc1cc(NC(=O)CSc2cn(CCNC(=O)c3ccc(F)cc3)c3ccccc23)no1
InChI Key InChIKey=LCWXTWRTCXJUJT-UHFFFAOYSA-N
Data  1 EC50
  Tab Delimited (TSV)   2D SDfile   Computed 3D by Vconf -m prep SDfile
Find this compound or compounds like it in BindingDB:
Activity Spreadsheet -- Enzyme Inhibition Constant Data from BindingDB
Found 1 hit for monomerid = 76951
TargetVoltage-dependent T-type calcium channel subunit alpha-1H(Homo sapiens (Human))
Vanderbilt Screening Center For Gpcrs, Ion Channels And Transporters
Curated by PubChem BioAssay
LigandPNGBDBM76951(4-fluoranyl-N-[2-[3-[2-[(5-methyl-1,2-oxazol-3-yl)...)
Affinity DataEC50:  2.60E+3nM. Assay description: Assay Provider: Xinmin Xie Assay Provider Affiliation: Bioscience Division, SRI International, Menlo Park, CA Grant Title: HTS Assay for Cav3 T-Type ...
In DepthDetails PCBioAssay