BDBM76954 2-benzoyl-6-(2-furyl)-4-(phenoxymethyl)-1,5,2-dioxazinane::MLS000043780::SMR000020990::[6-(2-furanyl)-4-(phenoxymethyl)-1,5,2-dioxazinan-2-yl]-phenylmethanone::[6-(2-furyl)-4-(phenoxymethyl)-1,5,2-dioxazinan-2-yl]-phenyl-methanone::[6-(furan-2-yl)-4-(phenoxymethyl)-1,5,2-dioxazinan-2-yl]-phenyl-methanone::[6-(furan-2-yl)-4-(phenoxymethyl)-1,5,2-dioxazinan-2-yl]-phenylmethanone::cid_3242195
SMILES O=C(N1CC(COc2ccccc2)OC(O1)c1ccco1)c1ccccc1
InChI Key InChIKey=LEHRTFFXYSXILL-UHFFFAOYSA-N
Data  1 EC50
  Tab Delimited (TSV)   2D SDfile   Computed 3D by Vconf -m prep SDfile
Find this compound or compounds like it in BindingDB:
Activity Spreadsheet -- Enzyme Inhibition Constant Data from BindingDB
Found 1 hit for monomerid = 76954
TargetVoltage-dependent T-type calcium channel subunit alpha-1H(Homo sapiens (Human))
Vanderbilt Screening Center For Gpcrs, Ion Channels And Transporters
Curated by PubChem BioAssay
LigandPNGBDBM76954(2-benzoyl-6-(2-furyl)-4-(phenoxymethyl)-1,5,2-diox...)
Affinity DataEC50:  1.24E+4nM. Assay description: Assay Provider: Xinmin Xie Assay Provider Affiliation: Bioscience Division, SRI International, Menlo Park, CA Grant Title: HTS Assay for Cav3 T-Type ...
In DepthDetails PCBioAssay