BDBM77055 US10093697, 8.::US10487111, Example 8.::US9694018, 8
SMILES CCCCC1(CCCC)CN(c2ccccc2)c2cc(SC)c(OCC(=O)N[C@@H](C(=O)N[C@@H]([C@@H](C)O)C(O)=O)c3ccc(O)cc3)cc2S(=O)(=O)N1
InChI Key InChIKey=AYYWZAJMBFSYQP-NICCLAEBSA-N
Data  3 IC50
  Tab Delimited (TSV)   2D SDfile   Computed 3D by Vconf -m prep SDfile
Find this compound or compounds like it in BindingDB:
Activity Spreadsheet -- Enzyme Inhibition Constant Data from BindingDB
Found 3 hits for monomerid = 77055
TargetBile acid receptor(Homo sapiens (Human))
Albireo
US Patent
LigandPNGBDBM77055(US10093697, 8. | US10487111, Example 8. | US969401...)
Affinity DataIC50:  0.110nM. Assay description: ISBT Hu HEK Uptake SPA 13203 IBAT HUM Ileal Bile Acid Transporter Human HEK Glycocholic acid Uptake Radiometric¿SPA Inhibitor IC50 Mean IC50 (nM) was...
In DepthDetails US Patent
TargetIleal sodium/bile acid cotransporter(Homo sapiens (Human))
Albireo
US Patent
LigandPNGBDBM77055(US10093697, 8. | US10487111, Example 8. | US969401...)
Affinity DataIC50:  0.110nM. Assay description: ISBT Hu HEK Uptake SPA 13203 IBAT HUM Ileal Bile Acid Transporter Human HEK Glycocholic acid Uptake Radiometric—SPA Inhibitor IC50 Mean IC50 (nM) was...
In DepthDetails US Patent
TargetIleal sodium/bile acid cotransporter(Homo sapiens (Human))
Albireo
US Patent
LigandPNGBDBM77055(US10093697, 8. | US10487111, Example 8. | US969401...)
Affinity DataIC50:  0.110nM. Assay description: ISBT Hu HEK Uptake SPA 13203 IBAT HUM Ileal Bile Acid Transporter Human HEK Glycocholic acid Uptake Radiometric SPA Inhibitor IC50 Mean IC50 (nM) was...
In DepthDetails US Patent