BDBM77588 MLS001221226::N-[(salicyloylamino)thiocarbamoyl]thiophene-2-carboxamide::N-[[(2-hydroxybenzoyl)amino]carbamothioyl]thiophene-2-carboxamide::N-[[(2-hydroxyphenyl)carbonylamino]carbamothioyl]thiophene-2-carboxamide::N-[[[(2-hydroxyphenyl)-oxomethyl]hydrazo]-sulfanylidenemethyl]-2-thiophenecarboxamide::SMR000608474::Thiophene-2-carboxylic acid [N'-(2-hydroxy-benzoyl)-hydrazinocarbothioyl]-amide::cid_1932924
SMILES Oc1ccccc1C(=O)NNC(=S)NC(=O)c1cccs1
InChI Key InChIKey=ALKDCROVEGPPNP-UHFFFAOYSA-N
Data  2 IC50
  Tab Delimited (TSV)   2D SDfile   Computed 3D by Vconf -m prep SDfile
Find this compound or compounds like it in BindingDB:
Activity Spreadsheet -- Enzyme Inhibition Constant Data from BindingDB
Found 2 hits for monomerid = 77588
TargetGroup 3 secretory phospholipase A2(Homo sapiens)
The Scripps Research Institute Molecular Screening Center
Curated by PubChem BioAssay
LigandPNGBDBM77588(MLS001221226 | N-[(salicyloylamino)thiocarbamoyl]t...)
Affinity DataIC50:  1.22E+5nM. Assay description: Source (MLPCN Center Name): The Scripps Research Institute Molecular Screening Center Affiliation: The Scripps Research Institute, TSRI Assay Provide...
In DepthDetails PCBioAssay
TargetRecBCD enzyme subunit RecD(Escherichia coli str. K-12 substr. MG1655)
The Scripps Research Institute Molecular Screening Center
Curated by PubChem BioAssay
LigandPNGBDBM77588(MLS001221226 | N-[(salicyloylamino)thiocarbamoyl]t...)
Affinity DataIC50:  7.99E+4nM. Assay description: Source (MLPCN Center Name): The Scripps Research Institute Molecular Screening Center (SRIMSC) Affiliation: The Scripps Research Institute, TSRI Assa...
In DepthDetails PCBioAssay