BDBM77724 MLS000592149::N-[(5-nitro-2-thienyl)methyleneamino]nicotinamide::N-[(5-nitro-2-thiophenyl)methylideneamino]-3-pyridinecarboxamide::N-[(5-nitrothiophen-2-yl)methylideneamino]pyridine-3-carboxamide::N-[(E)-(5-nitro-2-thienyl)methyleneamino]nicotinamide::Nicotinic acid [1-(5-nitro-thiophen-2-yl)-meth-(E)-ylidene]-hydrazide::SMR000218349::cid_571584
SMILES [O-][N+](=O)c1ccc(\C=N\NC(=O)c2cccnc2)s1
InChI Key InChIKey=KFQYDHVVCXUQTM-NTUHNPAUSA-N
Data  3 IC50  2 EC50
  Tab Delimited (TSV)   2D SDfile   Computed 3D by Vconf -m prep SDfile
Find this compound or compounds like it in BindingDB:
Activity Spreadsheet -- Enzyme Inhibition Constant Data from BindingDB
Found 5 hits for monomerid = 77724
TargetMitochondrial import inner membrane translocase subunit TIM10(Saccharomyces cerevisiae S288c)
Burnham Center For Chemical Genomics
Curated by PubChem BioAssay
LigandPNGBDBM77724(MLS000592149 | N-[(5-nitro-2-thienyl)methyleneamin...)
Affinity DataIC50:  7.01E+4nM. Assay description: Data Source: Sanford-Burnham Center for Chemical Genomics (SBCCG) Source Affiliation: Sanford-Burnham Medical Research Institute(SBMRI, San Diego, CA...
In DepthDetails PCBioAssay
TargetSentrin-specific protease 8(Homo sapiens (Human))
Burnham Center For Chemical Genomics
Curated by PubChem BioAssay
LigandPNGBDBM77724(MLS000592149 | N-[(5-nitro-2-thienyl)methyleneamin...)
Affinity DataIC50:  1.81E+4nM
In DepthDetails PCBioAssay
TargetMetabotropic glutamate receptor 4(Rattus norvegicus (Rat))
Vanderbilt University Medical Center
Curated by ChEMBL
LigandPNGBDBM77724(MLS000592149 | N-[(5-nitro-2-thienyl)methyleneamin...)
Affinity DataEC50:  860nM. Assay description: Positive allosteric modulation of rat mGluR4 expressed in CHO cells coexpressing Gqi5 assessed as calcium mobilization
In DepthDetails ArticlePubMed
TargetMetabotropic glutamate receptor 4(Homo sapiens (Human))
Vanderbilt University Medical Center
Curated by ChEMBL
LigandPNGBDBM77724(MLS000592149 | N-[(5-nitro-2-thienyl)methyleneamin...)
Affinity DataEC50:  1.17E+3nM. Assay description: Positive allosteric modulation of human mGluR4 expressed in CHO cells coexpressing Gqi5 assessed as calcium mobilization
In DepthDetails ArticlePubMed
TargetSentrin-specific protease 8(Homo sapiens (Human))
Burnham Center For Chemical Genomics
Curated by PubChem BioAssay
LigandPNGBDBM77724(MLS000592149 | N-[(5-nitro-2-thienyl)methyleneamin...)
Affinity DataIC50:  1.81E+4nM
In DepthDetails PCBioAssay