BDBM77737 2,5-dimethyl-1-phenyl-N-(p-tolyl)pyrrole-3-carboxamide::2,5-dimethyl-N-(4-methylphenyl)-1-phenyl-3-pyrrolecarboxamide::2,5-dimethyl-N-(4-methylphenyl)-1-phenyl-pyrrole-3-carboxamide::2,5-dimethyl-N-(4-methylphenyl)-1-phenylpyrrole-3-carboxamide::MLS000390701::SMR000259739::cid_2368804
SMILES Cc1cc(C(=O)Nc2ccc(C)cc2)c(C)n1-c1ccccc1
InChI Key InChIKey=PHEHYVPQUHDIAN-UHFFFAOYSA-N
Data  7 IC50
  Tab Delimited (TSV)   2D SDfile   Computed 3D by Vconf -m prep SDfile
Find this compound or compounds like it in BindingDB:
Activity Spreadsheet -- Enzyme Inhibition Constant Data from BindingDB
Found 7 hits for monomerid = 77737
TargetGlucose-6-phosphate 1-dehydrogenase(Homo sapiens (Human))
Burnham Center For Chemical Genomics
Curated by PubChem BioAssay
LigandPNGBDBM77737(2,5-dimethyl-1-phenyl-N-(p-tolyl)pyrrole-3-carboxa...)
Affinity DataIC50: >8.00E+4nM. Assay description: Data Source: Sanford-Burnham Center for Chemical Genomics (SBCCG) Source Affiliation: Sanford-Burnham Medical Research Institute (SBMRI, San Diego CA...
In DepthDetails PCBioAssay
TargetGlucose-6-phosphate dehydrogenase-6-phosphogluconolactonase(Plasmodium falciparum 3D7)
Burnham Center For Chemical Genomics
Curated by PubChem BioAssay
LigandPNGBDBM77737(2,5-dimethyl-1-phenyl-N-(p-tolyl)pyrrole-3-carboxa...)
Affinity DataIC50:  1.41E+4nM. Assay description: Data Source: Sanford-Burnham Center for Chemical Genomics (SBCCG) Source Affiliation: Sanford-Burnham Medical Research Institute (SBMRI, San Diego CA...
In DepthDetails PCBioAssay
TargetGlucose-6-phosphate dehydrogenase-6-phosphogluconolactonase(Plasmodium falciparum 3D7)
Burnham Center For Chemical Genomics
Curated by PubChem BioAssay
LigandPNGBDBM77737(2,5-dimethyl-1-phenyl-N-(p-tolyl)pyrrole-3-carboxa...)
Affinity DataIC50: >8.00E+4nM. Assay description: Data Source: Sanford-Burnham Center for Chemical Genomics (SBCCG) Source Affiliation: Sanford-Burnham Medical Research Institute (SBMRI, San Diego CA...
In DepthDetails PCBioAssay
TargetNuclear receptor coactivator 3(Homo sapiens (Human))
The Scripps Research Institute Molecular Screening Center
Curated by PubChem BioAssay
LigandPNGBDBM77737(2,5-dimethyl-1-phenyl-N-(p-tolyl)pyrrole-3-carboxa...)
Affinity DataIC50: >3.59E+4nM. Assay description: Source (MLPCN Center Name): The Scripps Research Institute Molecular Screening Center (SRIMSC) Affiliation: The Scripps Research Institute, TSRI Assa...
In DepthDetails PCBioAssay
TargetTegument protein VP16(Human herpesvirus 1 (strain 17) (HHV-1) (Human her...)
The Scripps Research Institute Molecular Screening Center
Curated by PubChem BioAssay
LigandPNGBDBM77737(2,5-dimethyl-1-phenyl-N-(p-tolyl)pyrrole-3-carboxa...)
Affinity DataIC50:  223nM. Assay description: Source (MLPCN Center Name): The Scripps Research Institute Molecular Screening Center (SRIMSC) Affiliation: The Scripps Research Institute, TSRI Assa...
In DepthDetails PCBioAssay
TargetNuclear receptor coactivator 1(Homo sapiens (Human))
The Scripps Research Institute Molecular Screening Center
Curated by PubChem BioAssay
LigandPNGBDBM77737(2,5-dimethyl-1-phenyl-N-(p-tolyl)pyrrole-3-carboxa...)
Affinity DataIC50: >3.59E+4nM. Assay description: Source (MLPCN Center Name): The Scripps Research Institute Molecular Screening Center (SRIMSC) Affiliation: The Scripps Research Institute, TSRI Assa...
In DepthDetails PCBioAssay
TargetGlucose-6-phosphate dehydrogenase-6-phosphogluconolactonase(Plasmodium falciparum 3D7)
Burnham Center For Chemical Genomics
Curated by PubChem BioAssay
LigandPNGBDBM77737(2,5-dimethyl-1-phenyl-N-(p-tolyl)pyrrole-3-carboxa...)
Affinity DataIC50: >8.00E+4nM. Assay description: Data Source: Sanford-Burnham Center for Chemical Genomics (SBCCG) Source Affiliation: Sanford-Burnham Medical Research Institute (SBMRI, San Diego CA...
In DepthDetails PCBioAssay