BDBM78171 3-cyclopentylpropanoic acid [[amino-(3-nitrophenyl)methylidene]amino] ester::3-cyclopentylpropionic acid [[amino-(3-nitrophenyl)methylene]amino] ester::MLS000580058::N'-[(3-cyclopentylpropanoyl)oxy]-3-nitrobenzenecarboximidamide::SMR000199302::[[amino-(3-nitrophenyl)methylidene]amino] 3-cyclopentylpropanoate::[[azanyl-(3-nitrophenyl)methylidene]amino] 3-cyclopentylpropanoate::cid_2949456
SMILES NC(=NOC(=O)CCC1CCCC1)c1cccc(c1)[N+]([O-])=O
InChI Key InChIKey=BBEOAHCDXBORTD-UHFFFAOYSA-N
Data  2 IC50
  Tab Delimited (TSV)   2D SDfile   Computed 3D by Vconf -m prep SDfile
Find this compound or compounds like it in BindingDB:
Activity Spreadsheet -- Enzyme Inhibition Constant Data from BindingDB
Found 2 hits for monomerid = 78171
TargetMitochondrial import inner membrane translocase subunit TIM23(Saccharomyces cerevisiae S288c)
Burnham Center For Chemical Genomics
Curated by PubChem BioAssay
LigandPNGBDBM78171(3-cyclopentylpropanoic acid [[amino-(3-nitrophenyl...)
Affinity DataIC50:  1.08E+4nM. Assay description: Data Source: Sanford-Burnham Center for Chemical Genomics (SBCCG) Source Affiliation: Sanford-Burnham Medical Research Institute(SBMRI, San Diego, CA...
In DepthDetails PCBioAssay
TargetMitochondrial import inner membrane translocase subunit TIM10(Saccharomyces cerevisiae S288c)
Burnham Center For Chemical Genomics
Curated by PubChem BioAssay
LigandPNGBDBM78171(3-cyclopentylpropanoic acid [[amino-(3-nitrophenyl...)
Affinity DataIC50:  6.48E+3nM. Assay description: Data Source: Sanford-Burnham Center for Chemical Genomics (SBCCG) Source Affiliation: Sanford-Burnham Medical Research Institute(SBMRI, San Diego, CA...
In DepthDetails PCBioAssay