BDBM78361 1-(3-Chloro-phenyl)-3-diethylamino-pyrrolidine-2,5-dione::1-(3-chlorophenyl)-3-(diethylamino)pyrrolidine-2,5-dione::1-(3-chlorophenyl)-3-(diethylamino)pyrrolidine-2,5-quinone::MLS001203275::SMR000513830::cid_2840997
SMILES CCN(CC)c1cc(O)n(c1O)-c1cccc(Cl)c1
InChI Key InChIKey=MLQDZOVVRJLECQ-UHFFFAOYSA-N
Data  2 IC50
  Tab Delimited (TSV)   2D SDfile   Computed 3D by Vconf -m prep SDfile
Find this compound or compounds like it in BindingDB:
Activity Spreadsheet -- Enzyme Inhibition Constant Data from BindingDB
Found 2 hits for monomerid = 78361
TargetMitochondrial import inner membrane translocase subunit TIM23(Saccharomyces cerevisiae S288c)
Burnham Center For Chemical Genomics
Curated by PubChem BioAssay
LigandPNGBDBM78361(1-(3-Chloro-phenyl)-3-diethylamino-pyrrolidine-2,5...)
Affinity DataIC50:  2.46E+3nM. Assay description: Data Source: Sanford-Burnham Center for Chemical Genomics (SBCCG) Source Affiliation: Sanford-Burnham Medical Research Institute(SBMRI, San Diego, CA...
In DepthDetails PCBioAssay
TargetMitochondrial import inner membrane translocase subunit TIM10(Saccharomyces cerevisiae S288c)
Burnham Center For Chemical Genomics
Curated by PubChem BioAssay
LigandPNGBDBM78361(1-(3-Chloro-phenyl)-3-diethylamino-pyrrolidine-2,5...)
Affinity DataIC50:  9.25E+3nM. Assay description: Data Source: Sanford-Burnham Center for Chemical Genomics (SBCCG) Source Affiliation: Sanford-Burnham Medical Research Institute(SBMRI, San Diego, CA...
In DepthDetails PCBioAssay