BDBM78398 MLS001105787::SMR000665769::[5-[(2-chloranyl-4-fluoranyl-phenoxy)methyl]-1,2-oxazol-3-yl]-(4-pyrazin-2-ylpiperazin-1-yl)methanone::[5-[(2-chloro-4-fluoro-phenoxy)methyl]isoxazol-3-yl]-(4-pyrazin-2-ylpiperazino)methanone::[5-[(2-chloro-4-fluorophenoxy)methyl]-1,2-oxazol-3-yl]-(4-pyrazin-2-ylpiperazin-1-yl)methanone::[5-[(2-chloro-4-fluorophenoxy)methyl]-3-isoxazolyl]-[4-(2-pyrazinyl)-1-piperazinyl]methanone::cid_24791380
SMILES Fc1ccc(OCc2cc(no2)C(=O)N2CCN(CC2)c2cnccn2)c(Cl)c1
InChI Key InChIKey=KUQZFRWOLWTNRV-UHFFFAOYSA-N
Data  2 IC50
  Tab Delimited (TSV)   2D SDfile   Computed 3D by Vconf -m prep SDfile
Find this compound or compounds like it in BindingDB:
Activity Spreadsheet -- Enzyme Inhibition Constant Data from BindingDB
Found 2 hits for monomerid = 78398
TargetMitochondrial import inner membrane translocase subunit TIM23(Saccharomyces cerevisiae S288c)
Burnham Center For Chemical Genomics
Curated by PubChem BioAssay
LigandPNGBDBM78398(MLS001105787 | SMR000665769 | [5-[(2-chloranyl-4-f...)
Affinity DataIC50:  5.45E+3nM. Assay description: Data Source: Sanford-Burnham Center for Chemical Genomics (SBCCG) Source Affiliation: Sanford-Burnham Medical Research Institute(SBMRI, San Diego, CA...
In DepthDetails PCBioAssay
TargetMitochondrial import inner membrane translocase subunit TIM10(Saccharomyces cerevisiae S288c)
Burnham Center For Chemical Genomics
Curated by PubChem BioAssay
LigandPNGBDBM78398(MLS001105787 | SMR000665769 | [5-[(2-chloranyl-4-f...)
Affinity DataIC50:  1.17E+4nM. Assay description: Data Source: Sanford-Burnham Center for Chemical Genomics (SBCCG) Source Affiliation: Sanford-Burnham Medical Research Institute(SBMRI, San Diego, CA...
In DepthDetails PCBioAssay