BDBM78450 N-[5-(3,4-dimethylphenyl)-1,3,4-oxadiazol-2-yl]-2-methyl-2-phenoxy-propanamide::N-[5-(3,4-dimethylphenyl)-1,3,4-oxadiazol-2-yl]-2-methyl-2-phenoxy-propionamide::N-[5-(3,4-dimethylphenyl)-1,3,4-oxadiazol-2-yl]-2-methyl-2-phenoxypropanamide::VU0405171-1::cid_44251484
SMILES Cc1ccc(cc1C)-c1nnc(NC(=O)C(C)(C)Oc2ccccc2)o1
InChI Key InChIKey=BKFWOTLGPAJGEJ-UHFFFAOYSA-N
Data  1 EC50
  Tab Delimited (TSV)   2D SDfile   Computed 3D by Vconf -m prep SDfile
Find this compound or compounds like it in BindingDB:
Activity Spreadsheet -- Enzyme Inhibition Constant Data from BindingDB
Found 1 hit for monomerid = 78450
TargetVoltage-dependent T-type calcium channel subunit alpha-1H(Homo sapiens (Human))
Vanderbilt Screening Center For Gpcrs, Ion Channels And Transporters
Curated by PubChem BioAssay
LigandPNGBDBM78450(N-[5-(3,4-dimethylphenyl)-1,3,4-oxadiazol-2-yl]-2-...)
Affinity DataEC50:  2.10E+3nM. Assay description: Assay Provider: Xinmin Xie Assay Provider Affiliation: Bioscience Division, SRI International, Menlo Park, CA Grant Title: HTS Assay for Cav3 T-Type ...
In DepthDetails PCBioAssay