BDBM78469 2-(2-chloranyl-4-fluoranyl-phenoxy)-N-[5-(2,3-dihydro-1,4-benzodioxin-6-yl)-1,3,4-oxadiazol-2-yl]ethanamide::2-(2-chloro-4-fluoro-phenoxy)-N-[5-(2,3-dihydro-1,4-benzodioxin-6-yl)-1,3,4-oxadiazol-2-yl]acetamide::2-(2-chloro-4-fluorophenoxy)-N-[5-(2,3-dihydro-1,4-benzodioxin-6-yl)-1,3,4-oxadiazol-2-yl]acetamide::VU0405190-1::cid_44251501
SMILES Fc1ccc(OCC(=O)Nc2nnc(o2)-c2ccc3OCCOc3c2)c(Cl)c1
InChI Key InChIKey=OMEFRPHBQGKDMC-UHFFFAOYSA-N
Data  1 EC50
  Tab Delimited (TSV)   2D SDfile   Computed 3D by Vconf -m prep SDfile
Find this compound or compounds like it in BindingDB:
Activity Spreadsheet -- Enzyme Inhibition Constant Data from BindingDB
Found 1 hit for monomerid = 78469
TargetVoltage-dependent T-type calcium channel subunit alpha-1H(Homo sapiens (Human))
Vanderbilt Screening Center For Gpcrs, Ion Channels And Transporters
Curated by PubChem BioAssay
LigandPNGBDBM78469(2-(2-chloranyl-4-fluoranyl-phenoxy)-N-[5-(2,3-dihy...)
Affinity DataEC50:  2.60E+3nM. Assay description: Assay Provider: Xinmin Xie Assay Provider Affiliation: Bioscience Division, SRI International, Menlo Park, CA Grant Title: HTS Assay for Cav3 T-Type ...
In DepthDetails PCBioAssay