BDBM78474 2-methyl-N-(5-naphthalen-2-yl-1,3,4-oxadiazol-2-yl)-2-phenoxy-propanamide::2-methyl-N-(5-naphthalen-2-yl-1,3,4-oxadiazol-2-yl)-2-phenoxypropanamide::2-methyl-N-[5-(2-naphthalenyl)-1,3,4-oxadiazol-2-yl]-2-phenoxypropanamide::2-methyl-N-[5-(2-naphthyl)-1,3,4-oxadiazol-2-yl]-2-phenoxy-propionamide::VU0405401-1::cid_44263499
SMILES CC(C)(Oc1ccccc1)C(=O)Nc1nnc(o1)-c1ccc2ccccc2c1
InChI Key InChIKey=ORNSHEDFMSUXAY-UHFFFAOYSA-N
Data  1 EC50
  Tab Delimited (TSV)   2D SDfile   Computed 3D by Vconf -m prep SDfile
Find this compound or compounds like it in BindingDB:
Activity Spreadsheet -- Enzyme Inhibition Constant Data from BindingDB
Found 1 hit for monomerid = 78474
TargetVoltage-dependent T-type calcium channel subunit alpha-1H(Homo sapiens (Human))
Vanderbilt Screening Center For Gpcrs, Ion Channels And Transporters
Curated by PubChem BioAssay
LigandPNGBDBM78474(2-methyl-N-(5-naphthalen-2-yl-1,3,4-oxadiazol-2-yl...)
Affinity DataEC50:  1.10E+3nM. Assay description: Assay Provider: Xinmin Xie Assay Provider Affiliation: Bioscience Division, SRI International, Menlo Park, CA Grant Title: HTS Assay for Cav3 T-Type ...
In DepthDetails PCBioAssay