BDBM79598 1-(4-benzylpiperidine-1-carbonyl)-6-chloro-10,10-diketo-thioxanthen-9-one::1-(4-benzylpiperidine-1-carbonyl)-6-chloro-10,10-dioxothioxanthen-9-one::6-chloranyl-10,10-bis(oxidanylidene)-1-[4-(phenylmethyl)piperidin-1-yl]carbonyl-thioxanthen-9-one::6-chloro-10,10-dioxo-1-[oxo-[4-(phenylmethyl)-1-piperidinyl]methyl]-9-thioxanthenone::MLS001144813::SMR000568202::cid_42628219
SMILES Clc1ccc2C(=O)c3c(cccc3S(=O)(=O)c2c1)C(=O)N1CCC(Cc2ccccc2)CC1
InChI Key InChIKey=MQQJRZLRXSPKOQ-UHFFFAOYSA-N
Data  2 EC50
  Tab Delimited (TSV)   2D SDfile   Computed 3D by Vconf -m prep SDfile
Find this compound or compounds like it in BindingDB:
Activity Spreadsheet -- Enzyme Inhibition Constant Data from BindingDB
Found 2 hits for monomerid = 79598
TargetTumor necrosis factor receptor superfamily member 10B(Homo sapiens (Human))
Burnham Center For Chemical Genomics
Curated by PubChem BioAssay
LigandPNGBDBM79598(1-(4-benzylpiperidine-1-carbonyl)-6-chloro-10,10-d...)
Affinity DataEC50: >1.25E+4nM
Ligand InfoPC cidPC sid
In DepthDetails PCBioAssay
TargetNeurotensin receptor type 1(Homo sapiens (Human))
Burnham Center For Chemical Genomics
Curated by PubChem BioAssay
LigandPNGBDBM79598(1-(4-benzylpiperidine-1-carbonyl)-6-chloro-10,10-d...)
Affinity DataEC50:  1.66E+4nM. Assay description: Data Source: Sanford-Burnham Center for Chemical Genomics (SBCCG) Source Affiliation: Sanford-Burnham Medical Research Institute (SBMRI, San Diego, C...
Ligand InfoPC cidPC sid
In DepthDetails PCBioAssay