BDBM79629 2-(1-azepanyl)-6-fluoro-4-methylquinoline;2,2,2-trifluoroacetic acid::2-(azepan-1-yl)-6-fluoranyl-4-methyl-quinoline;2,2,2-tris(fluoranyl)ethanoic acid::2-(azepan-1-yl)-6-fluoro-4-methyl-quinoline;2,2,2-trifluoroacetic acid::2-(azepan-1-yl)-6-fluoro-4-methylquinoline;2,2,2-trifluoroacetic acid::VU0206683-4::cid_46926566
SMILES Cc1cc(nc2ccc(F)cc12)N1CCCCCC1
InChI Key InChIKey=BSKLPSKRWDVCRT-UHFFFAOYSA-N
Data  1 IC50
  Tab Delimited (TSV)   2D SDfile   Computed 3D by Vconf -m prep SDfile
Find this compound or compounds like it in BindingDB:
Activity Spreadsheet -- Enzyme Inhibition Constant Data from BindingDB
Found 1 hit for monomerid = 79629
TargetShort transient receptor potential channel 4(Mus musculus)
Johns Hopkins Ion Channel Center
Curated by PubChem BioAssay
LigandPNGBDBM79629(2-(1-azepanyl)-6-fluoro-4-methylquinoline;2,2,2-tr...)
Affinity DataIC50:  1.63E+3nM. Assay description: The inhibitory effects of test compounds on TRPC4 channels were evaluated in electrophysiological assays using a QPatch16 automated electrophysiology...
In DepthDetails PCBioAssay