BDBM79664 2-[[5-(2-methoxyphenyl)-4-methyl-1,2,4-triazol-3-yl]sulfanylmethyl]-1,3-benzothiazole::2-[[[5-(2-methoxyphenyl)-4-methyl-1,2,4-triazol-3-yl]thio]methyl]-1,3-benzothiazole::MLS000565799::SMR000152894::cid_2078590
SMILES COc1ccccc1-c1nnc(SCc2nc3ccccc3s2)n1C
InChI Key InChIKey=HSIRJMNBCQGYRD-UHFFFAOYSA-N
Data  1 EC50
  Tab Delimited (TSV)   2D SDfile   Computed 3D by Vconf -m prep SDfile
Find this compound or compounds like it in BindingDB:
Activity Spreadsheet -- Enzyme Inhibition Constant Data from BindingDB
Found 1 hit for monomerid = 79664
TargetTropomyosin alpha-1 chain(Sus scrofa)
The Scripps Research Institute Molecular Screening Center
Curated by PubChem BioAssay
LigandPNGBDBM79664(2-[[5-(2-methoxyphenyl)-4-methyl-1,2,4-triazol-3-y...)
Affinity DataEC50: >7.15E+4nM. Assay description: Source (MLPCN Center Name): The Scripps Research Institute Molecular Screening Center (SRIMSC) Affiliation: The Scripps Research Institute, TSRI Assa...
In DepthDetails PCBioAssay