BDBM79837 5-tert-Butyl-3-methyl-furan-2-carboxylic acid cyclopentylcarbamoylmethyl-o-tolyl-amide::5-tert-butyl-N-[2-(cyclopentylamino)-2-keto-ethyl]-3-methyl-N-(o-tolyl)-2-furamide::5-tert-butyl-N-[2-(cyclopentylamino)-2-oxidanylidene-ethyl]-3-methyl-N-(2-methylphenyl)furan-2-carboxamide::5-tert-butyl-N-[2-(cyclopentylamino)-2-oxoethyl]-3-methyl-N-(2-methylphenyl)-2-furancarboxamide::5-tert-butyl-N-[2-(cyclopentylamino)-2-oxoethyl]-3-methyl-N-(2-methylphenyl)furan-2-carboxamide::MLS000556809::SMR000173542::cid_1454979
SMILES Cc1cc(oc1C(=O)N(CC(=O)NC1CCCC1)c1ccccc1C)C(C)(C)C
InChI Key InChIKey=BNBJBKJMJONHSB-UHFFFAOYSA-N
Data  2 IC50
  Tab Delimited (TSV)   2D SDfile   Computed 3D by Vconf -m prep SDfile
Find this compound or compounds like it in BindingDB:
Activity Spreadsheet -- Enzyme Inhibition Constant Data from BindingDB
Found 2 hits for monomerid = 79837
TargetOrexin/Hypocretin receptor type 1(Homo sapiens (Human))
The Scripps Research Institute Molecular Screening Center
Curated by PubChem BioAssay
LigandPNGBDBM79837(5-tert-Butyl-3-methyl-furan-2-carboxylic acid cycl...)
Affinity DataIC50:  3.52E+3nM. Assay description: Source (MLPCN Center Name): The Scripps Research Institute Molecular Screening Center (SRIMSC) Affiliation: The Scripps Research Institute, TSRI Assa...
In DepthDetails PCBioAssay
TargetOrexin/Hypocretin receptor type 1(Homo sapiens (Human))
The Scripps Research Institute Molecular Screening Center
Curated by PubChem BioAssay
LigandPNGBDBM79837(5-tert-Butyl-3-methyl-furan-2-carboxylic acid cycl...)
Affinity DataIC50:  264nM. Assay description: Source (MLPCN Center Name): The Scripps Research Institute Molecular Screening Center (SRIMSC) Affiliation: The Scripps Research Institute, TSRI Assa...
In DepthDetails PCBioAssay