BDBM79957 2-[2-(3-aminophenyl)ethynyl]-10-methyl-9-acridinone::2-[2-(3-aminophenyl)ethynyl]-10-methyl-acridin-9-one::2-[2-(3-aminophenyl)ethynyl]-10-methylacridin-9-one::MLS002402856::SMR001370623::cid_44142359
SMILES Cn1c2ccccc2c(=O)c2cc(ccc12)C#Cc1cccc(N)c1
InChI Key InChIKey=QCIBTTGAPXYYPW-UHFFFAOYSA-N
Data  2 IC50
  Tab Delimited (TSV)   2D SDfile   Computed 3D by Vconf -m prep SDfile
Find this compound or compounds like it in BindingDB:
Activity Spreadsheet -- Enzyme Inhibition Constant Data from BindingDB
Found 2 hits for monomerid = 79957
TargetOrexin/Hypocretin receptor type 1(Homo sapiens (Human))
The Scripps Research Institute Molecular Screening Center
Curated by PubChem BioAssay
LigandPNGBDBM79957(2-[2-(3-aminophenyl)ethynyl]-10-methyl-9-acridinon...)
Affinity DataIC50:  1.69E+3nM. Assay description: Source (MLPCN Center Name): The Scripps Research Institute Molecular Screening Center (SRIMSC) Affiliation: The Scripps Research Institute, TSRI Assa...
Ligand InfoPC cidPC sid
In DepthDetails PCBioAssay
TargetOrexin/Hypocretin receptor type 1(Homo sapiens (Human))
The Scripps Research Institute Molecular Screening Center
Curated by PubChem BioAssay
LigandPNGBDBM79957(2-[2-(3-aminophenyl)ethynyl]-10-methyl-9-acridinon...)
Affinity DataIC50:  1.50E+3nM. Assay description: Source (MLPCN Center Name): The Scripps Research Institute Molecular Screening Center (SRIMSC) Affiliation: The Scripps Research Institute, TSRI Assa...
Ligand InfoPC cidPC sid
In DepthDetails PCBioAssay