BDBM79975 MLS000532669::N-phenyl-2-pyridinecarbothioamide::N-phenylpyridine-2-carbothioamide::N-phenylthiopicolinamide::SMR000137608::cid_759327
SMILES S=C(Nc1ccccc1)c1ccccn1
InChI Key InChIKey=HOMILEBHBIPJEZ-UHFFFAOYSA-N
Data  2 IC50
  Tab Delimited (TSV)   2D SDfile   Computed 3D by Vconf -m prep SDfile
Find this compound or compounds like it in BindingDB:
Activity Spreadsheet -- Enzyme Inhibition Constant Data from BindingDB
Found 2 hits for monomerid = 79975
TargetC-C chemokine receptor type 6(Homo sapiens (Human))
Burnham Center For Chemical Genomics
Curated by PubChem BioAssay
LigandPNGBDBM79975(MLS000532669 | N-phenyl-2-pyridinecarbothioamide |...)
Affinity DataIC50:  1.69E+4nM. Assay description: Data Source: Sanford-Burnham Center for Chemical Genomics (SBCCG) Source Affiliation: Sanford-Burnham Medical Research Institute(SBMRI, San Diego, CA...
In DepthDetails PCBioAssay
TargetBeta-galactosidase(Escherichia coli)
Burnham Center For Chemical Genomics
Curated by PubChem BioAssay
LigandPNGBDBM79975(MLS000532669 | N-phenyl-2-pyridinecarbothioamide |...)
Affinity DataIC50: >6.66E+4nM. Assay description: Data Source: Sanford-Burnham Center for Chemical Genomics (SBCCG) Source Affiliation: Sanford-Burnham Medical Research Institute(SBMRI, San Diego, C...
In DepthDetails PCBioAssay