BDBM80237 4-amino-3-(1-naphthalenylmethyl)-1H-1,2,4-triazole-5-thione::4-amino-3-(1-naphthylmethyl)-1H-1,2,4-triazole-5-thione::4-amino-3-(naphthalen-1-ylmethyl)-1H-1,2,4-triazole-5-thione::4-azanyl-3-(naphthalen-1-ylmethyl)-1H-1,2,4-triazole-5-thione::MLS001004013::SMR000347725::cid_713091
SMILES Nn1c(Cc2cccc3ccccc23)n[nH]c1=S
InChI Key InChIKey=PGIIWYILQYIDHT-UHFFFAOYSA-N
Data  2 IC50
  Tab Delimited (TSV)   2D SDfile   Computed 3D by Vconf -m prep SDfile
Find this compound or compounds like it in BindingDB:
Activity Spreadsheet -- Enzyme Inhibition Constant Data from BindingDB
Found 2 hits for monomerid = 80237
TargetDNA dC->dU-editing enzyme APOBEC-3A(Homo sapiens (Human))
Burnham Center For Chemical Genomics
Curated by PubChem BioAssay
LigandPNGBDBM80237(4-amino-3-(1-naphthalenylmethyl)-1H-1,2,4-triazole...)
Affinity DataIC50: >1.00E+5nMT: 2°C. Assay description: Data Source: Sanford-Burnham Center for Chemical Genomics (SBCCG) Source Affiliation: Sanford-Burnham Medical Research Institute (SBMRI, San Diego, C...
In DepthDetails PCBioAssay
TargetDNA dC->dU-editing enzyme APOBEC-3G(Homo sapiens (Human))
Burnham Center For Chemical Genomics
Curated by PubChem BioAssay
LigandPNGBDBM80237(4-amino-3-(1-naphthalenylmethyl)-1H-1,2,4-triazole...)
Affinity DataIC50:  2.94E+3nMT: 2°C. Assay description: Data Source: Sanford-Burnham Center for Chemical Genomics (SBCCG) Source Affiliation: Sanford-Burnham Medical Research Institute (SBMRI, San Diego, C...
In DepthDetails PCBioAssay