BDBM82576 (4-methoxy-1,3-benzothiazol-2-yl)-(5-phenyl-1,3,4-oxadiazol-2-yl)amine::MLS-0437604.0002::N-(4-methoxy-1,3-benzothiazol-2-yl)-5-phenyl-1,3,4-oxadiazol-2-amine::cid_7109935
SMILES COc1cccc2sc(Nc3nnc(o3)-c3ccccc3)nc12
InChI Key InChIKey=RUMPVQLLKOXVQY-UHFFFAOYSA-N
Data  1 IC50
  Tab Delimited (TSV)   2D SDfile   Computed 3D by Vconf -m prep SDfile
Find this compound or compounds like it in BindingDB:
Activity Spreadsheet -- Enzyme Inhibition Constant Data from BindingDB
Found 1 hit for monomerid = 82576
TargetDual specificity protein phosphatase 3(Homo sapiens (Human))
Burnham Center For Chemical Genomics
Curated by PubChem BioAssay
LigandPNGBDBM82576((4-methoxy-1,3-benzothiazol-2-yl)-(5-phenyl-1,3,4-...)
Affinity DataIC50:  1.20E+4nM. Assay description: Data Source: Sanford-Burnham Center for Chemical Genomics (SBCCG) Source Affiliation: Sanford-Burnham Medical Research Institute (SBMRI, San Diego, C...
In DepthDetails PCBioAssay